program: Orca
programVersion: 5.0.2
elementType: O O O O N N C C C C C C C C C C C C C C C C C H H H H H H H H H H H H H H H H H H H H H H
charge: 0
multiplicity: 1
keywords: wb97x-d3
keywords: def2-TZVPP
keywords: def2/J RIJCOSX
keywords: DEFGRID2
keywords: scfconv7
keywords: smallprint printgap noloewdin
keywords: NOSOSCF
formula: C17H22N2O4
InChI: InChI=1/C17H22N2O4/c1-6-7-18-9-13(20)19(16(18)22)10-23-15(21)14-12(8-11(2)3)17(14,4)5/h1,8,12,14H,7,9-10H2,2-5H3
45 atoms
O  -0.037933 0.887539 0.586609
O  -0.54029 2.339446 2.203009
O  2.336535 1.686674 -1.664364
O  2.052383 -1.809258 1.248171
N  2.063986 0.167911 0.042287
N  2.884317 -1.659999 -0.896084
C  -2.709653 2.012451 -0.603083
C  -2.772509 0.569002 -0.222809
C  -2.284825 1.579649 0.790509
C  -3.993397 2.805551 -0.667155
C  -1.685652 2.470113 -1.613759
C  -4.067812 -0.131055 -0.01783
C  -0.890974 1.660588 1.275418
C  -4.313941 -1.045161 0.921581
C  -5.653011 -1.710281 1.027952
C  -3.299187 -1.487413 1.930937
C  1.328574 0.972377 0.958592
C  2.469123 0.58868 -1.202746
C  2.310396 -1.19698 0.248277
C  3.117843 -0.615592 -1.854624
C  3.460816 -2.973845 -1.002751
C  4.92148 -2.94094 -1.023795
C  6.119226 -2.892558 -1.060418
H  -1.988968 -0.04427 -0.659774
H  -2.985442 1.8479 1.573143
H  -4.716488 2.490564 0.084966
H  -3.79486 3.867148 -0.512409
H  -4.464769 2.697508 -1.646476
H  -2.11145 2.41833 -2.617689
H  -1.397936 3.507532 -1.434805
H  -0.777856 1.871342 -1.614376
H  -4.862292 0.111317 -0.718397
H  -6.09344 -1.549498 2.015182
H  -6.35606 -1.340497 0.282448
H  -5.565528 -2.79202 0.899907
H  -3.637139 -1.263517 2.945947
H  -3.159617 -2.570189 1.884811
H  -2.325473 -1.023824 1.791362
H  1.684191 2.00093 0.900544
H  1.481638 0.592357 1.968118
H  2.655543 -0.81969 -2.824065
H  4.183995 -0.428222 -2.01983
H  3.093656 -3.467016 -1.907366
H  3.10984 -3.563749 -0.155041
H  7.182101 -2.859338 -1.080285
totalener: -1071.51731193 hartree
nucrepener: 1944.76589384 hartree
electener: -3016.28320577 hartree
oneelecener: -5321.26254076 hartree
twoeener: 2304.97933500 hartree
kineticenergy: 1066.93789719 hartree
xcener: -102.625203563092 hartree
chargesum: -0.0000000
charge: -0.269118 -0.354861 -0.340145 -0.379735 -0.145765 -0.169428 0.119534 0.023207 -0.111564 -0.277881 -0.244145 -0.268378 0.321280 -0.002211 -0.212319 -0.221324 0.065769 0.225464 0.344672 -0.020047 -0.088815 -0.400032 0.104979 0.096374 0.091941 0.085805 0.095031 0.087925 0.082245 0.095079 0.082148 0.092770 0.085526 0.078151 0.086769 0.088784 0.088911 0.082391 0.130159 0.132274 0.103179 0.109849 0.124627 0.131788 0.249136
qa: -0.2691 -0.3549 -0.3401 -0.3797 -0.1458 -0.1694 0.1195 0.0232 -0.1116 -0.2779 -0.2441 -0.2684 0.3213 -0.0022 -0.2123 -0.2213 0.0658 0.2255 0.3447 -0.0200 -0.0888 -0.4000 0.1050 0.0964 0.0919 0.0858 0.0950 0.0879 0.0822 0.0951 0.0821 0.0928 0.0855 0.0782 0.0868 0.0888 0.0889 0.0824 0.1302 0.1323 0.1032 0.1098 0.1246 0.1318 0.2491
va: 2.0666 2.1489 2.1714 2.1442 3.1368 3.1375 3.7296 3.7745 3.8499 3.9161 3.9123 3.9101 4.2010 3.7291 3.9430 3.9394 3.9173 4.2489 4.3321 3.8917 3.9174 3.7731 3.6352 1.0223 1.0277 1.0052 1.0056 1.0011 1.0035 1.0034 1.0151 1.0098 0.9995 1.0097 0.9986 1.0011 1.0022 1.0216 1.0015 1.0060 1.0105 1.0088 0.9837 1.0097 0.9704
dispcorr: -0.021653973 hartree
energy: -1071.538965899176
dipole: -29.10132 29.35634 0.25502 -0.28547 -0.86462 -1.15009 -2.49050 1.20243 -1.28807
magnitude: 1.74553 au
magnitude: 4.43677 debye
