program: Orca
programVersion: 5.0.2
elementType: O O O O N N C C C C C C C C C C C C C C C C C H H H H H H H H H H H H H H H H H H H H H H
charge: 0
multiplicity: 1
keywords: wb97x-d3
keywords: def2-TZVPP
keywords: def2/J RIJCOSX
keywords: DEFGRID2
keywords: scfconv7
keywords: smallprint printgap noloewdin
keywords: NOSOSCF
formula: C17H22N2O4
InChI: InChI=1/C17H22N2O4/c1-6-7-18-9-13(20)19(16(18)22)10-23-15(21)14-12(8-11(2)3)17(14,4)5/h1,8,12,14H,7,9-10H2,2-5H3
45 atoms
O  0.277022 0.616499 -0.30614
O  -0.948575 2.43375 -0.719843
O  2.368904 -0.539134 -2.873346
O  3.103587 0.720652 1.445963
N  2.50215 0.365608 -0.760234
N  4.125426 -0.859125 0.113237
C  -2.911285 1.090981 1.333086
C  -3.397633 0.838603 -0.061429
C  -1.960177 0.513956 0.299589
C  -3.311707 0.158271 2.452284
C  -2.776259 2.523357 1.790173
C  -4.328467 -0.250625 -0.406702
C  -0.868188 1.311217 -0.294347
C  -5.33734 -0.197311 -1.280093
C  -6.201544 -1.398977 -1.525578
C  -5.715345 1.010462 -2.083574
C  1.419029 1.288194 -0.814187
C  2.840964 -0.502673 -1.773258
C  3.236869 0.130252 0.409244
C  3.934822 -1.386759 -1.209634
C  4.9164 -1.519772 1.11799
C  4.459661 -2.88467 1.371679
C  4.082181 -4.010552 1.539425
H  -3.49035 1.740909 -0.655334
H  -1.721763 -0.535142 0.434695
H  -3.328107 -0.889047 2.154148
H  -2.61307 0.247136 3.285709
H  -4.306593 0.411323 2.822967
H  -1.991209 2.620609 2.542624
H  -2.548315 3.209178 0.978555
H  -3.712742 2.847176 2.248208
H  -4.16602 -1.194849 0.104648
H  -6.167055 -1.699636 -2.575663
H  -5.898519 -2.254586 -0.923428
H  -7.248822 -1.183831 -1.298706
H  -5.071749 1.870591 -1.916204
H  -5.689614 0.783535 -3.152072
H  -6.739617 1.316888 -1.856981
H  1.267335 1.596328 -1.84847
H  1.655931 2.161039 -0.206269
H  3.602477 -2.429902 -1.199043
H  4.835768 -1.324504 -1.825653
H  4.861629 -0.926456 2.031656
H  5.966906 -1.539286 0.813883
H  3.742607 -5.004847 1.703513
totalener: -1071.52088510 hartree
nucrepener: 1887.52546448 hartree
electener: -2959.04634958 hartree
oneelecener: -5206.97807652 hartree
twoeener: 2247.93172694 hartree
kineticenergy: 1066.93321963 hartree
xcener: -102.625813253240 hartree
chargesum: 0.0000000
charge: -0.261467 -0.388368 -0.337816 -0.378387 -0.155427 -0.172308 0.079386 0.044202 -0.076083 -0.250176 -0.256144 -0.179789 0.337148 -0.054253 -0.201427 -0.237209 0.091632 0.233815 0.343881 -0.027865 -0.079163 -0.398033 0.097688 0.088330 0.068925 0.071010 0.093371 0.093361 0.087764 0.099188 0.085402 0.069661 0.085157 0.075638 0.082850 0.084462 0.086371 0.085384 0.126188 0.126836 0.109871 0.104137 0.130708 0.122919 0.248630
qa: -0.2615 -0.3884 -0.3378 -0.3784 -0.1554 -0.1723 0.0794 0.0442 -0.0761 -0.2502 -0.2561 -0.1798 0.3371 -0.0543 -0.2014 -0.2372 0.0916 0.2338 0.3439 -0.0279 -0.0792 -0.3980 0.0977 0.0883 0.0689 0.0710 0.0934 0.0934 0.0878 0.0992 0.0854 0.0697 0.0852 0.0756 0.0828 0.0845 0.0864 0.0854 0.1262 0.1268 0.1099 0.1041 0.1307 0.1229 0.2486
va: 2.1177 2.1138 2.1806 2.1478 3.1354 3.1323 3.7459 3.7875 3.8778 3.9190 3.9127 3.9085 4.2200 3.8336 3.9335 3.9443 3.9018 4.2544 4.3406 3.8897 3.9107 3.7816 3.6404 1.0325 1.0366 1.0109 1.0041 1.0032 1.0025 1.0217 1.0003 1.0223 0.9984 1.0124 0.9982 1.0162 0.9992 0.9988 1.0035 1.0024 1.0120 1.0085 1.0117 0.9836 0.9707
dispcorr: -0.019393499 hartree
energy: -1071.540278597090
dipole: -35.43902 35.92284 0.48382 -0.45600 -0.75892 -1.21492 3.87833 -3.50980 0.36853
magnitude: 1.35865 au
magnitude: 3.45342 debye
