program: Orca
programVersion: 5.0.2
elementType: O O O O N N C C C C C C C C C C C C C C C C C H H H H H H H H H H H H H H H H H H H H H H
charge: 0
multiplicity: 1
keywords: wb97x-d3
keywords: def2-TZVPP
keywords: def2/J RIJCOSX
keywords: DEFGRID2
keywords: scfconv7
keywords: smallprint printgap noloewdin
keywords: NOSOSCF
formula: C17H22N2O4
InChI: InChI=1/C17H22N2O4/c1-6-7-18-9-13(20)19(16(18)22)10-23-15(21)14-12(8-11(2)3)17(14,4)5/h1,8,12,14H,7,9-10H2,2-5H3
45 atoms
O  0.203087 0.331788 -0.324733
O  -0.911389 1.842304 -1.529853
O  1.820333 -2.011704 -2.142096
O  3.385493 0.893266 1.004754
N  2.369605 -0.310665 -0.692791
N  3.948986 -1.285702 0.510184
C  -3.078914 1.525595 0.706433
C  -3.450435 0.666878 -0.460623
C  -2.064147 0.551962 0.126977
C  -3.610337 1.164051 2.072316
C  -2.931083 3.013116 0.502089
C  -4.381577 -0.48652 -0.353434
C  -0.905473 1.000942 -0.670067
C  -5.70802 -0.389732 -0.260077
C  -6.576701 -1.608594 -0.183148
C  -6.435267 0.919816 -0.236241
C  1.377326 0.641414 -1.059817
C  2.475565 -1.567314 -1.243473
C  3.265297 -0.11708 0.367168
C  3.59617 -2.254032 -0.489895
C  5.102164 -1.415625 1.36025
C  6.343296 -1.527172 0.597692
C  7.348309 -1.641725 -0.046756
H  -3.472119 1.193655 -1.411951
H  -1.873374 -0.322641 0.739461
H  -4.604208 1.590907 2.220834
H  -3.695622 0.088116 2.216593
H  -2.958493 1.560297 2.852638
H  -3.89269 3.500395 0.67731
H  -2.217381 3.436852 1.210942
H  -2.603011 3.274519 -0.500237
H  -3.935727 -1.476672 -0.378789
H  -5.9941 -2.528693 -0.200499
H  -7.176275 -1.606387 0.730513
H  -7.281397 -1.642157 -1.017606
H  -5.76575 1.776691 -0.277038
H  -7.124022 0.993441 -1.081574
H  -7.04429 1.009981 0.666672
H  1.194862 0.574158 -2.131963
H  1.736143 1.640811 -0.814918
H  3.245325 -3.196785 -0.061331
H  4.425867 -2.477332 -1.168306
H  4.991664 -2.291933 2.00533
H  5.137762 -0.543079 2.013576
H  8.243972 -1.728703 -0.612834
totalener: -1071.51999519 hartree
nucrepener: 1878.78195699 hartree
electener: -2950.30195219 hartree
oneelecener: -5189.47541186 hartree
twoeener: 2239.17345968 hartree
kineticenergy: 1066.94914383 hartree
xcener: -102.627757171561 hartree
chargesum: -0.0000000
charge: -0.264953 -0.388769 -0.336813 -0.380435 -0.150119 -0.170484 0.064722 -0.030367 -0.076771 -0.245647 -0.262958 -0.185330 0.338977 -0.023123 -0.209889 -0.245064 0.088715 0.233289 0.341889 -0.027807 -0.084457 -0.399721 0.102199 0.109768 0.078449 0.084375 0.082817 0.098365 0.079421 0.090471 0.106046 0.091062 0.079777 0.083606 0.086691 0.084340 0.098708 0.087569 0.124755 0.129491 0.103492 0.110675 0.123421 0.130755 0.248861
qa: -0.2650 -0.3888 -0.3368 -0.3804 -0.1501 -0.1705 0.0647 -0.0304 -0.0768 -0.2456 -0.2630 -0.1853 0.3390 -0.0231 -0.2099 -0.2451 0.0887 0.2333 0.3419 -0.0278 -0.0845 -0.3997 0.1022 0.1098 0.0784 0.0844 0.0828 0.0984 0.0794 0.0905 0.1060 0.0911 0.0798 0.0836 0.0867 0.0843 0.0987 0.0876 0.1248 0.1295 0.1035 0.1107 0.1234 0.1308 0.2489
va: 2.1159 2.1109 2.1806 2.1457 3.1348 3.1332 3.7343 3.8233 3.8690 3.9089 3.9047 3.8596 4.2150 3.7364 3.9376 3.9351 3.9008 4.2550 4.3392 3.8863 3.9170 3.7765 3.6380 1.0247 1.0338 1.0022 1.0070 1.0061 1.0021 1.0029 1.0213 1.0125 1.0105 0.9989 0.9984 1.0104 1.0038 0.9986 1.0027 1.0045 1.0101 1.0098 0.9839 1.0107 0.9706
dispcorr: -0.020473561 hartree
energy: -1071.540468755533
dipole: -38.29224 38.58762 0.29538 4.01893 -5.05010 -1.03117 7.61867 -6.79099 0.82768
magnitude: 1.35485 au
magnitude: 3.44375 debye
