program: Orca
programVersion: 5.0.2
elementType: O O O O N N C C C C C C C C C C C C C C C C C H H H H H H H H H H H H H H H H H H H H H H
charge: 0
multiplicity: 1
keywords: wb97x-d3
keywords: def2-TZVPP
keywords: def2/J RIJCOSX
keywords: DEFGRID2
keywords: scfconv7
keywords: smallprint printgap noloewdin
keywords: NOSOSCF
formula: C17H22N2O4
InChI: InChI=1/C17H22N2O4/c1-6-7-18-9-13(20)19(16(18)22)10-23-15(21)14-12(8-11(2)3)17(14,4)5/h1,8,12,14H,7,9-10H2,2-5H3
45 atoms
O  0.227141 1.10577 0.305952
O  -0.85099 0.970242 2.268372
O  3.36973 2.346747 -1.063246
O  2.003936 -1.382494 1.172868
N  2.489306 0.694966 0.278637
N  3.68395 -1.049175 -0.371001
C  -2.452097 -1.128967 0.481981
C  -3.295404 0.041387 0.867698
C  -1.938408 0.284371 0.250862
C  -2.794378 -1.905238 -0.766457
C  -1.840425 -1.982397 1.567017
C  -4.53291 0.405595 0.130711
C  -0.836816 0.814264 1.077793
C  -5.015781 1.643343 0.013743
C  -6.291393 1.918989 -0.722596
C  -4.342604 2.844942 0.602482
C  1.449851 1.41472 0.943864
C  3.31822 1.209189 -0.690469
C  2.653272 -0.685953 0.440096
C  4.156628 0.042851 -1.175597
C  4.056488 -2.419891 -0.595315
C  3.696541 -2.883431 -1.933467
C  3.416943 -3.241724 -3.043298
H  -3.322198 0.236872 1.936962
H  -1.917536 0.600379 -0.786126
H  -1.908768 -2.409737 -1.155962
H  -3.541734 -2.671643 -0.549953
H  -3.189751 -1.270872 -1.559816
H  -1.680192 -1.435377 2.493273
H  -2.501326 -2.821923 1.790235
H  -0.877838 -2.387893 1.251147
H  -5.095569 -0.409652 -0.314888
H  -6.125564 2.615179 -1.54868
H  -6.732695 1.011252 -1.132239
H  -7.031061 2.385766 -0.067374
H  -3.424818 2.603368 1.134373
H  -4.099051 3.572942 -0.175703
H  -5.009186 3.354477 1.30275
H  1.660089 2.479272 0.847235
H  1.422888 1.139712 1.99688
H  3.987982 -0.121103 -2.244607
H  5.220445 0.249148 -1.027605
H  3.559926 -3.029667 0.160718
H  5.133159 -2.542609 -0.445425
H  3.159194 -3.569885 -4.021564
totalener: -1071.51867658 hartree
nucrepener: 1938.99734738 hartree
electener: -3010.51602396 hartree
oneelecener: -5310.12371246 hartree
twoeener: 2299.60768850 hartree
kineticenergy: 1066.94221768 hartree
xcener: -102.627296347371 hartree
chargesum: -0.0000000
charge: -0.268180 -0.374914 -0.341880 -0.387352 -0.137482 -0.163855 0.128024 -0.027507 -0.093387 -0.280519 -0.243499 -0.233991 0.334599 -0.006225 -0.211053 -0.226004 0.059189 0.235516 0.350387 -0.028536 -0.087539 -0.401520 0.106664 0.105535 0.083561 0.093434 0.090887 0.082211 0.094387 0.082237 0.093621 0.093210 0.084446 0.077519 0.086536 0.081614 0.084437 0.089199 0.117793 0.141647 0.110370 0.103406 0.131102 0.123597 0.248315
qa: -0.2682 -0.3749 -0.3419 -0.3874 -0.1375 -0.1639 0.1280 -0.0275 -0.0934 -0.2805 -0.2435 -0.2340 0.3346 -0.0062 -0.2111 -0.2260 0.0592 0.2355 0.3504 -0.0285 -0.0875 -0.4015 0.1067 0.1055 0.0836 0.0934 0.0909 0.0822 0.0944 0.0822 0.0936 0.0932 0.0844 0.0775 0.0865 0.0816 0.0844 0.0892 0.1178 0.1416 0.1104 0.1034 0.1311 0.1236 0.2483
va: 2.1053 2.1241 2.1773 2.1268 3.1078 3.1347 3.7760 3.8375 3.8143 3.9081 3.8948 3.9011 4.1953 3.7320 3.9412 3.9424 3.9007 4.2570 4.3188 3.8934 3.9126 3.7831 3.6313 1.0255 1.0315 1.0065 1.0009 1.0044 1.0201 1.0015 1.0108 1.0090 0.9990 1.0098 0.9985 1.0210 1.0007 1.0016 1.0102 1.0135 1.0111 1.0076 1.0105 0.9838 0.9708
dispcorr: -0.021256062 hartree
energy: -1071.539932642583
dipole: -30.38499 31.03785 0.65286 -2.07723 1.32145 -0.75579 -2.52359 1.48401 -1.03958
magnitude: 1.44158 au
magnitude: 3.66422 debye
