program: Orca
programVersion: 5.0.2
elementType: O O O O N N C C C C C C C C C C C C C C C C C H H H H H H H H H H H H H H H H H H H H H H
charge: 0
multiplicity: 1
keywords: wb97x-d3
keywords: def2-TZVPP
keywords: def2/J RIJCOSX
keywords: DEFGRID2
keywords: scfconv7
keywords: smallprint printgap noloewdin
keywords: NOSOSCF
formula: C17H22N2O4
InChI: InChI=1/C17H22N2O4/c1-6-7-18-9-13(20)19(16(18)22)10-23-15(21)14-12(8-11(2)3)17(14,4)5/h1,8,12,14H,7,9-10H2,2-5H3
45 atoms
O  0.338352 1.983378 0.93773
O  0.343179 -0.148265 1.620335
O  3.505251 -0.007857 2.132812
O  1.928108 1.974228 -1.660458
N  2.52538 1.220704 0.44459
N  3.31693 0.163458 -1.332237
C  -2.089879 -0.11756 -0.429079
C  -2.532874 -0.369432 0.981376
C  -1.645344 0.807932 0.694264
C  -3.073536 0.4728 -1.408644
C  -1.099355 -1.058071 -1.071013
C  -3.929763 -0.144726 1.435481
C  -0.241041 0.790723 1.150619
C  -4.944653 -0.980447 1.213769
C  -6.31949 -0.700239 1.739666
C  -4.798682 -2.258348 0.445459
C  1.715893 2.114221 1.217247
C  3.267171 0.185172 0.976854
C  2.517861 1.203191 -0.952471
C  3.744467 -0.62646 -0.209807
C  3.340425 -0.325141 -2.684945
C  2.503899 -1.510638 -2.866146
C  1.823242 -2.49195 -2.97887
H  -2.016249 -1.190186 1.473165
H  -2.104305 1.7910 0.6783
H  -3.664211 -0.315768 -1.879554
H  -3.771585 1.160338 -0.933254
H  -2.548789 1.013868 -2.197646
H  -1.634441 -1.847562 -1.603691
H  -0.4798 -0.535264 -1.802443
H  -0.438452 -1.537785 -0.352042
H  -4.118524 0.75638 2.01206
H  -7.049167 -0.651742 0.927602
H  -6.652596 -1.496598 2.409903
H  -6.364509 0.239348 2.288771
H  -3.794256 -2.402576 0.052188
H  -5.037109 -3.118334 1.076524
H  -5.496757 -2.288838 -0.394858
H  1.950583 3.147146 0.97125
H  1.938706 1.924634 2.26819
H  4.827582 -0.764584 -0.176376
H  3.270766 -1.61424 -0.189997
H  4.369068 -0.556482 -2.973933
H  3.000395 0.477914 -3.34003
H  1.211243 -3.355035 -3.086651
totalener: -1071.51559262 hartree
nucrepener: 2001.18641177 hartree
electener: -3072.70200440 hartree
oneelecener: -5434.61373749 hartree
twoeener: 2361.91173310 hartree
kineticenergy: 1066.94697778 hartree
xcener: -102.628447267631 hartree
chargesum: -0.0000000
charge: -0.254865 -0.376314 -0.327902 -0.371577 -0.148639 -0.159841 0.098967 -0.020629 -0.090775 -0.253365 -0.298269 -0.196546 0.334682 -0.022354 -0.210851 -0.241818 0.084928 0.247262 0.300306 -0.035386 -0.074595 -0.390856 0.081443 0.109392 0.081451 0.083235 0.083354 0.105288 0.081762 0.100082 0.099008 0.088965 0.084131 0.086024 0.079603 0.081423 0.098746 0.086898 0.125501 0.130186 0.104238 0.116371 0.122389 0.131715 0.247232
qa: -0.2549 -0.3763 -0.3279 -0.3716 -0.1486 -0.1598 0.0990 -0.0206 -0.0908 -0.2534 -0.2983 -0.1965 0.3347 -0.0224 -0.2109 -0.2418 0.0849 0.2473 0.3003 -0.0354 -0.0746 -0.3909 0.0814 0.1094 0.0815 0.0832 0.0834 0.1053 0.0818 0.1001 0.0990 0.0890 0.0841 0.0860 0.0796 0.0814 0.0987 0.0869 0.1255 0.1302 0.1042 0.1164 0.1224 0.1317 0.2472
va: 2.1332 2.1265 2.1915 2.1509 3.0846 3.1286 3.7518 3.8110 3.8437 3.9027 3.8980 3.8631 4.2688 3.7396 3.9384 3.9359 3.9146 4.2447 4.3865 3.8867 3.9168 3.7634 3.6712 1.0255 1.0334 1.0016 1.0070 1.0050 1.0050 1.0055 1.0158 1.0134 0.9991 0.9982 1.0105 1.0101 1.0030 0.9996 0.9938 1.0146 1.0116 1.0069 0.9852 1.0084 0.9724
dispcorr: -0.024148300 hartree
energy: -1071.539740923372
dipole: -32.56933 32.37078 -0.19855 -10.98218 10.53970 -0.44248 -4.32400 3.40754 -0.91646
magnitude: 1.03688 au
magnitude: 2.63554 debye
