program: Orca
programVersion: 5.0.2
elementType: O O O O N N C C C C C C C C C C C C C C C C C H H H H H H H H H H H H H H H H H H H H H H
charge: 0
multiplicity: 1
keywords: wb97x-d3
keywords: def2-TZVPP
keywords: def2/J RIJCOSX
keywords: DEFGRID2
keywords: scfconv7
keywords: smallprint printgap noloewdin
keywords: NOSOSCF
formula: C17H22N2O4
InChI: InChI=1/C17H22N2O4/c1-6-7-18-9-13(20)19(16(18)22)10-23-15(21)14-12(8-11(2)3)17(14,4)5/h1,8,12,14H,7,9-10H2,2-5H3
45 atoms
O  0.417608 0.959423 0.767402
O  -0.561415 -0.230005 2.396334
O  3.639318 2.442631 -0.004322
O  1.841652 -1.734699 -0.337324
N  2.562757 0.411619 0.13941
N  3.347165 -0.600375 -1.66627
C  -2.703829 -0.476911 0.069551
C  -3.215322 0.341188 1.217209
C  -1.878913 0.677719 0.618385
C  -3.296127 -0.259531 -1.301244
C  -2.271956 -1.901708 0.317616
C  -4.347584 1.293486 1.07765
C  -0.643316 0.40347 1.380052
C  -5.632742 0.941045 1.030104
C  -6.722558 1.963121 0.918177
C  -6.095731 -0.482312 1.094501
C  1.706078 0.644271 1.257921
C  3.424119 1.334109 -0.405725
C  2.510724 -0.77378 -0.604625
C  4.055432 0.648339 -1.601396
C  3.739786 -1.683195 -2.528184
C  5.089956 -2.165052 -2.242884
C  6.205908 -2.53603 -2.006951
H  -3.143434 -0.152698 2.183358
H  -1.827177 1.547255 -0.028816
H  -2.58809 -0.561616 -2.074975
H  -4.200245 -0.858904 -1.425996
H  -3.568482 0.779887 -1.478738
H  -3.107309 -2.577062 0.120349
H  -1.453084 -2.185363 -0.346334
H  -1.943454 -2.07308 1.339997
H  -4.09826 2.350014 1.03553
H  -7.335381 1.786719 0.030571
H  -7.397401 1.913854 1.77653
H  -6.329549 2.977412 0.859628
H  -6.734268 -0.641281 1.967353
H  -6.700735 -0.733981 0.219898
H  -5.273654 -1.193172 1.150337
H  2.104843 1.487443 1.820921
H  1.677986 -0.240503 1.891577
H  3.926936 1.255126 -2.501377
H  5.129173 0.512955 -1.433167
H  3.679548 -1.363611 -3.572227
H  3.018697 -2.491769 -2.401569
H  7.189314 -2.879726 -1.792449
totalener: -1071.51882978 hartree
nucrepener: 1911.18450902 hartree
electener: -2982.70333880 hartree
oneelecener: -5254.40390948 hartree
twoeener: 2271.70057068 hartree
kineticenergy: 1066.94160912 hartree
xcener: -102.626403471575 hartree
chargesum: 0.0000000
charge: -0.269230 -0.373959 -0.342099 -0.382952 -0.135019 -0.167601 0.061482 -0.022453 -0.082486 -0.249819 -0.253676 -0.194670 0.341285 -0.021738 -0.210624 -0.244240 0.064580 0.235618 0.346454 -0.030815 -0.085002 -0.402256 0.105702 0.108127 0.081380 0.096393 0.084755 0.082734 0.079576 0.097806 0.100014 0.089225 0.083020 0.086714 0.079266 0.098413 0.086627 0.084513 0.117944 0.141053 0.103587 0.109492 0.123806 0.130285 0.248789
qa: -0.2692 -0.3740 -0.3421 -0.3830 -0.1350 -0.1676 0.0615 -0.0225 -0.0825 -0.2498 -0.2537 -0.1947 0.3413 -0.0217 -0.2106 -0.2442 0.0646 0.2356 0.3465 -0.0308 -0.0850 -0.4023 0.1057 0.1081 0.0814 0.0964 0.0848 0.0827 0.0796 0.0978 0.1000 0.0892 0.0830 0.0867 0.0793 0.0984 0.0866 0.0845 0.1179 0.1411 0.1036 0.1095 0.1238 0.1303 0.2488
va: 2.1074 2.1321 2.1759 2.1326 3.1080 3.1312 3.7608 3.8162 3.8421 3.9047 3.9043 3.8650 4.2361 3.7363 3.9387 3.9355 3.8955 4.2545 4.3246 3.8956 3.9210 3.7766 3.6358 1.0267 1.0326 1.0059 1.0027 1.0069 1.0009 1.0088 1.0206 1.0133 0.9993 0.9981 1.0105 1.0034 0.9991 1.0105 1.0092 1.0133 1.0106 1.0086 0.9840 1.0097 0.9705
dispcorr: -0.021313297 hartree
energy: -1071.540143079902
dipole: -36.96432 37.20496 0.24064 -2.63258 2.45726 -0.17532 -2.49737 1.05696 -1.44041
magnitude: 1.47086 au
magnitude: 3.73862 debye
