program: Orca
programVersion: 5.0.2
elementType: O O O O N N C C C C C C C C C C C C C C C C C H H H H H H H H H H H H H H H H H H H H H H
charge: 0
multiplicity: 1
keywords: wb97x-d3
keywords: def2-TZVPP
keywords: def2/J RIJCOSX
keywords: DEFGRID2
keywords: scfconv7
keywords: smallprint printgap noloewdin
keywords: NOSOSCF
formula: C17H22N2O4
InChI: InChI=1/C17H22N2O4/c1-6-7-18-9-13(20)19(16(18)22)10-23-15(21)14-12(8-11(2)3)17(14,4)5/h1,8,12,14H,7,9-10H2,2-5H3
45 atoms
O  0.321921 1.855336 1.091913
O  0.26572 -0.37563 1.282158
O  3.417814 -0.328504 2.145447
O  1.952839 2.067692 -1.447355
N  2.516667 1.10099 0.57773
N  3.28794 0.194451 -1.28772
C  -2.131759 0.227557 -0.751035
C  -2.597412 -0.378551 0.542582
C  -1.683879 0.820425 0.572998
C  -3.0833 1.067266 -1.568832
C  -1.15082 -0.544591 -1.598955
C  -3.98487 -0.254177 1.028847
C  -0.286879 0.660975 1.02826
C  -4.767216 -1.241063 1.471394
C  -6.159574 -0.960591 1.953521
C  -4.365251 -2.683431 1.537281
C  1.692623 1.905789 1.428255
C  3.215203 -0.007695 1.010785
C  2.517834 1.216227 -0.814386
C  3.698304 -0.703911 -0.243747
C  3.322294 -0.159701 -2.681416
C  2.49514 -1.326864 -2.983735
C  1.824054 -2.296104 -3.205574
H  -2.093992 -1.30459 0.797349
H  -2.126541 1.781325 0.813619
H  -3.711287 0.43071 -2.194552
H  -3.745499 1.679194 -0.958093
H  -2.528338 1.73941 -2.225047
H  -0.509825 -1.202703 -1.016044
H  -1.690852 -1.163998 -2.317601
H  -0.507864 0.132233 -2.165099
H  -4.402067 0.748735 1.031284
H  -6.897417 -1.52288 1.375499
H  -6.282738 -1.266465 2.995596
H  -6.414871 0.096159 1.883477
H  -4.419665 -3.053168 2.564163
H  -5.051407 -3.298239 0.949273
H  -3.359595 -2.874944 1.170645
H  1.959117 2.955917 1.333422
H  1.86864 1.572606 2.452197
H  4.780371 -0.852664 -0.213198
H  3.218038 -1.685035 -0.323869
H  4.353755 -0.356915 -2.986141
H  2.980848 0.701729 -3.256724
H  1.224855 -3.150001 -3.412969
totalener: -1071.51603158 hartree
nucrepener: 1998.57101789 hartree
electener: -3070.08704947 hartree
oneelecener: -5429.39670536 hartree
twoeener: 2359.30965588 hartree
kineticenergy: 1066.93853440 hartree
xcener: -102.628733409231 hartree
chargesum: 0.0000000
charge: -0.252714 -0.380909 -0.332484 -0.373349 -0.146300 -0.153694 0.120691 0.042382 -0.083216 -0.253233 -0.283014 -0.192370 0.331868 -0.050245 -0.204419 -0.236022 0.084452 0.246956 0.294852 -0.030595 -0.080556 -0.389286 0.083294 0.090185 0.071817 0.090990 0.070058 0.099001 0.086229 0.087578 0.095110 0.071420 0.082987 0.085141 0.076300 0.087676 0.083393 0.082369 0.123715 0.129615 0.104242 0.117407 0.123187 0.132151 0.247337
qa: -0.2527 -0.3809 -0.3325 -0.3733 -0.1463 -0.1537 0.1207 0.0424 -0.0832 -0.2532 -0.2830 -0.1924 0.3319 -0.0502 -0.2044 -0.2360 0.0845 0.2470 0.2949 -0.0306 -0.0806 -0.3893 0.0833 0.0902 0.0718 0.0910 0.0701 0.0990 0.0862 0.0876 0.0951 0.0714 0.0830 0.0851 0.0763 0.0877 0.0834 0.0824 0.1237 0.1296 0.1042 0.1174 0.1232 0.1322 0.2473
va: 2.1342 2.1248 2.1878 2.1488 3.0901 3.1298 3.7518 3.7924 3.8534 3.9122 3.9113 3.9034 4.2673 3.8240 3.9359 3.9458 3.9148 4.2445 4.3944 3.8858 3.9141 3.7639 3.6696 1.0340 1.0370 1.0036 1.0107 1.0034 1.0161 1.0041 1.0083 1.0210 0.9984 0.9980 1.0122 0.9990 0.9993 1.0157 0.9930 1.0146 1.0104 1.0078 0.9850 1.0086 0.9723
dispcorr: -0.023284337 hartree
energy: -1071.539315920734
dipole: -31.53421 31.44645 -0.08776 -9.46911 9.16989 -0.29922 -3.18213 2.34655 -0.83558
magnitude: 0.89187 au
magnitude: 2.26695 debye
