program: Orca
programVersion: 5.0.2
elementType: Br F F O O O C C C C C C C C C C C C C C C C C C C C C C C C H H H H H H H H H H H H H H H H H H H H H H H
charge: 0
multiplicity: 1
keywords: wb97x-d3
keywords: def2-TZVPP
keywords: def2/J RIJCOSX
keywords: DEFGRID2
keywords: scfconv7
keywords: smallprint printgap noloewdin
keywords: NOSOSCF
formula: C24H23BrF2O3
InChI: InChI=1/C24H23BrF2O3/c1-23(2,19-11-13-21(14-12-19)30-24(25,26)27)17-28-16-18-7-6-10-22(15-18)29-20-8-4-3-5-9-20/h3-15H,16-17H2,1-2H3
53 atoms
Br 2.374071 -3.346583 -1.581953
F  3.626744 -1.365092 -0.286109
F  2.16812 -0.661714 -1.700136
O  -4.074338 0.796928 -0.678041
O  1.573457 -1.455195 0.288676
O  0.638005 1.720562 0.724159
C  -4.126956 -1.353432 0.424109
C  -4.483388 0.135538 0.500093
C  -2.609803 -1.469938 0.345382
C  -4.823216 -2.004137 -0.772611
C  -4.671831 -2.010086 1.696609
C  -1.823722 -1.346065 1.493372
C  -1.939635 -1.608587 -0.86461
C  -4.017786 2.197834 -0.551195
C  -0.442812 -1.36328 1.434745
C  -0.551054 -1.609046 -0.953632
C  0.189539 -1.486948 0.208031
C  -2.821785 2.677422 0.235182
C  -1.599041 2.025853 0.116212
C  -2.917465 3.796336 1.055512
C  -0.496589 2.477911 0.825454
C  -1.801845 4.252563 1.745148
C  -0.583795 3.596532 1.645314
C  2.398191 -1.568832 -0.746576
C  1.882107 2.288491 0.729044
C  2.878216 1.605534 1.413721
C  2.171299 3.452678 0.02841
C  4.178984 2.086672 1.385437
C  3.474939 3.928831 0.020349
C  4.483273 3.250627 0.692496
H  -5.568494 0.245132 0.635204
H  -4.002427 0.572503 1.384732
H  -4.576879 -3.064945 -0.837421
H  -5.90528 -1.924628 -0.655556
H  -4.570652 -1.547716 -1.728587
H  -5.762132 -1.975966 1.698592
H  -4.335551 -1.513714 2.607181
H  -4.372702 -3.057347 1.75646
H  -2.283541 -1.224773 2.464828
H  -2.489684 -1.709161 -1.789564
H  -3.966559 2.597242 -1.567282
H  -4.936874 2.595243 -0.103102
H  0.144334 -1.266061 2.33913
H  -0.108171 -1.687366 -1.935191
H  -1.493644 1.153997 -0.518443
H  -3.866191 4.307701 1.163763
H  -1.88371 5.120192 2.386751
H  0.272168 3.947656 2.20756
H  2.634246 0.704792 1.962494
H  1.397316 3.982113 -0.512964
H  4.95481 1.550261 1.915988
H  3.702592 4.834691 -0.525839
H  5.497884 3.62515 0.674309
elementType: Br F O C H
totalener: -3928.09851820 hartree
nucrepener: 3592.61395590 hartree
electener: -7520.71247410 hartree
twoeener: 5062.94842619 hartree
cpcmener: -0.02638004 hartree
kineticenergy: 3918.77657175 hartree
xcener: -198.382810016108 hartree
chargesum: -0.0000000
charge: -0.084697 -0.150013 -0.161465 -0.388081 -0.261694 -0.316698 0.405130 -0.114705 -0.014349 -0.352076 -0.345308 -0.189216 -0.314971 0.069206 -0.253419 -0.094401 0.260438 0.049272 -0.331113 -0.214737 0.308816 -0.125602 -0.235612 0.448197 0.317351 -0.289541 -0.212651 -0.118368 -0.144463 -0.188316 0.109299 0.116473 0.115087 0.103570 0.093142 0.104318 0.102238 0.113329 0.145211 0.142661 0.107065 0.100589 0.150863 0.134751 0.152836 0.143120 0.161347 0.158019 0.147298 0.158555 0.160602 0.161863 0.160852
qa: -0.0847 -0.1500 -0.1615 -0.3881 -0.2617 -0.3167 0.4051 -0.1147 -0.0143 -0.3521 -0.3453 -0.1892 -0.3150 0.0692 -0.2534 -0.0944 0.2604 0.0493 -0.3311 -0.2147 0.3088 -0.1256 -0.2356 0.4482 0.3174 -0.2895 -0.2127 -0.1184 -0.1445 -0.1883 0.1093 0.1165 0.1151 0.1036 0.0931 0.1043 0.1022 0.1133 0.1452 0.1427 0.1071 0.1006 0.1509 0.1348 0.1528 0.1431 0.1613 0.1580 0.1473 0.1586 0.1606 0.1619 0.1609
va: 1.1734 1.1464 1.1321 1.9259 2.1398 2.0515 3.5305 3.9820 3.5869 3.9118 3.9142 3.9602 4.1880 3.8886 4.0051 3.9675 3.6652 3.5653 4.0365 3.9494 3.7131 3.8911 3.9529 4.5360 3.6173 3.9588 3.9381 3.8767 3.8909 3.9039 1.0027 0.9810 0.9998 1.0039 1.0129 1.0044 1.0021 1.0004 1.0003 1.0035 0.9901 0.9972 1.0021 1.0224 1.0061 1.0017 0.9891 0.9972 1.0153 0.9980 0.9895 0.9891 0.9891
dispcorr: -0.032601162 hartree
energy: -3928.131119364799
dipole: -66.63987 65.01770 -1.62217 48.42015 -47.45889 0.96125 28.75698 -27.86930 0.88768
magnitude: 2.08409 au
magnitude: 5.29733 debye
