program: Orca
programVersion: 5.0.2
elementType: Br F F O O O C C C C C C C C C C C C C C C C C C C C C C C C H H H H H H H H H H H H H H H H H H H H H H H
charge: 0
multiplicity: 1
keywords: wb97x-d3
keywords: def2-TZVPP
keywords: def2/J RIJCOSX
keywords: DEFGRID2
keywords: scfconv7
keywords: smallprint printgap noloewdin
keywords: NOSOSCF
formula: C24H23BrF2O3
InChI: InChI=1/C24H23BrF2O3/c1-23(2,19-11-13-21(14-12-19)30-24(25,26)27)17-28-16-18-7-6-10-22(15-18)29-20-8-4-3-5-9-20/h3-15H,16-17H2,1-2H3
53 atoms
Br 2.82431 -2.591089 -1.702679
F  2.380145 -3.615972 0.726554
F  3.955193 -2.144776 0.689233
O  -3.59465 0.579967 1.486433
O  1.935948 -1.437986 0.668285
O  0.227932 3.053983 -0.933445
C  -3.734913 -1.396256 0.127869
C  -4.11341 0.080654 0.272093
C  -2.219622 -1.507407 0.23878
C  -4.208619 -1.866191 -1.250611
C  -4.465489 -2.21888 1.188743
C  -1.404934 -0.86285 -0.694156
C  -1.594596 -2.176635 1.286931
C  -3.825184 1.95424 1.677735
C  -0.024935 -0.861857 -0.578247
C  -0.212119 -2.195267 1.417964
C  0.55716 -1.529711 0.484796
C  -3.040828 2.839443 0.739948
C  -1.731476 2.516331 0.390921
C  -3.624209 3.99321 0.229512
C  -1.022975 3.3545 -0.458713
C  -2.901346 4.829786 -0.609072
C  -1.597298 4.517836 -0.955391
C  2.734312 -2.419078 0.247264
C  1.236209 2.56335 -0.15136
C  2.279213 1.952641 -0.841487
C  1.290568 2.696757 1.23002
C  3.376199 1.471441 -0.146936
C  2.395202 2.20025 1.912652
C  3.439583 1.588103 1.236107
H  -3.723713 0.648152 -0.582367
H  -5.207756 0.181917 0.251503
H  -3.760092 -1.294379 -2.063614
H  -3.964258 -2.917663 -1.405865
H  -5.291883 -1.761262 -1.335378
H  -5.542886 -2.106572 1.058166
H  -4.227507 -1.913377 2.207636
H  -4.235178 -3.281577 1.097645
H  -1.844821 -0.322184 -1.522627
H  -2.178035 -2.688209 2.039183
H  -4.893293 2.191217 1.590354
H  -3.535708 2.170507 2.70931
H  0.580723 -0.325432 -1.295878
H  0.245013 -2.696368 2.260792
H  -1.277545 1.608203 0.768342
H  -4.649424 4.234106 0.482675
H  -3.358662 5.726844 -1.005123
H  -1.031233 5.157888 -1.619985
H  2.227225 1.8624 -1.919394
H  0.49663 3.182941 1.781068
H  4.182552 0.998701 -0.692239
H  2.434439 2.302889 2.989232
H  4.294765 1.208564 1.778852
elementType: Br F O C H
totalener: -3928.09965202 hartree
nucrepener: 3607.84426265 hartree
electener: -7535.94391467 hartree
twoeener: 5077.63180343 hartree
cpcmener: -0.02700955 hartree
kineticenergy: 3918.78678819 hartree
xcener: -198.382909228250 hartree
chargesum: 0.0000000
charge: -0.086672 -0.156768 -0.151201 -0.387386 -0.278088 -0.333252 0.397180 -0.091233 -0.047967 -0.338435 -0.366299 -0.246796 -0.180485 0.074189 -0.174015 -0.168887 0.206358 0.039722 -0.308203 -0.225206 0.376268 -0.106105 -0.283701 0.441608 0.340911 -0.274332 -0.230037 -0.113903 -0.138880 -0.206599 0.112992 0.112752 0.103008 0.108485 0.105390 0.104138 0.096483 0.110534 0.141038 0.147409 0.098742 0.108798 0.160238 0.152263 0.134523 0.142693 0.160302 0.145615 0.144345 0.159767 0.149480 0.161374 0.157846
qa: -0.0867 -0.1568 -0.1512 -0.3874 -0.2781 -0.3333 0.3972 -0.0912 -0.0480 -0.3384 -0.3663 -0.2468 -0.1805 0.0742 -0.1740 -0.1689 0.2064 0.0397 -0.3082 -0.2252 0.3763 -0.1061 -0.2837 0.4416 0.3409 -0.2743 -0.2300 -0.1139 -0.1389 -0.2066 0.1130 0.1128 0.1030 0.1085 0.1054 0.1041 0.0965 0.1105 0.1410 0.1474 0.0987 0.1088 0.1602 0.1523 0.1345 0.1427 0.1603 0.1456 0.1443 0.1598 0.1495 0.1614 0.1578
va: 1.1763 1.1384 1.1414 1.9124 2.0733 2.0645 3.5568 3.9368 3.6197 3.9254 3.9243 4.0532 3.9613 3.8838 3.9882 4.1056 3.6629 3.5998 3.9564 3.9570 3.5790 3.8701 4.0346 4.5608 3.6092 3.9137 3.8952 3.8174 3.8812 3.8802 0.9826 1.0037 1.0017 1.0024 1.0026 1.0061 1.0107 0.9991 1.0087 0.9963 0.9989 0.9898 0.9955 1.0054 1.0121 1.0020 0.9880 1.0079 1.0111 0.9970 0.9947 0.9887 0.9915
dispcorr: -0.033428634 hartree
energy: -3928.133080652246
dipole: -73.84351 71.66403 -2.17948 41.60255 -41.05255 0.55000 21.57487 -21.50395 0.07092
magnitude: 2.24892 au
magnitude: 5.71631 debye
