program: Orca
programVersion: 5.0.2
elementType: Br F F O O O C C C C C C C C C C C C C C C C C C C C C C C C H H H H H H H H H H H H H H H H H H H H H H H
charge: 0
multiplicity: 1
keywords: wb97x-d3
keywords: def2-TZVPP
keywords: def2/J RIJCOSX
keywords: DEFGRID2
keywords: scfconv7
keywords: smallprint printgap noloewdin
keywords: NOSOSCF
formula: C24H23BrF2O3
InChI: InChI=1/C24H23BrF2O3/c1-23(2,19-11-13-21(14-12-19)30-24(25,26)27)17-28-16-18-7-6-10-22(15-18)29-20-8-4-3-5-9-20/h3-15H,16-17H2,1-2H3
53 atoms
Br 3.083951 -2.823515 1.109838
F  3.000391 -2.065229 -1.455167
F  3.635877 -4.100763 -1.191701
O  -4.095752 1.244606 0.900798
O  1.539634 -3.693007 -1.031718
O  0.226446 4.453855 -0.564945
C  -3.290185 -0.931873 0.258355
C  -2.920453 0.500393 0.665154
C  -1.980172 -1.65155 -0.04864
C  -4.172501 -0.919437 -0.998048
C  -4.064977 -1.607161 1.390019
C  -1.512192 -2.714961 0.719641
C  -1.207241 -1.26208 -1.146142
C  -3.867079 2.55885 1.370535
C  -0.330156 -3.373473 0.407813
C  -0.026004 -1.907391 -1.477422
C  0.402155 -2.960413 -0.687205
C  -3.174992 3.410056 0.340771
C  -1.801622 3.596831 0.417823
C  -3.878271 3.928657 -0.743448
C  -1.131845 4.261784 -0.60047
C  -3.206292 4.626941 -1.735038
C  -1.827705 4.786016 -1.678973
C  2.755505 -3.196587 -0.784792
C  1.032509 3.451362 -0.082506
C  2.122542 3.832267 0.686893
C  0.809347 2.111632 -0.382653
C  2.996745 2.863337 1.159785
C  1.683747 1.153819 0.109015
C  2.778216 1.521296 0.880969
H  -2.292304 0.478007 1.567961
H  -2.322199 0.962217 -0.130057
H  -3.724565 -0.353289 -1.815595
H  -4.348219 -1.935944 -1.35294
H  -5.145787 -0.475924 -0.7881
H  -3.515413 -1.594169 2.332719
H  -4.297919 -2.645228 1.148464
H  -5.013196 -1.09809 1.558756
H  -2.067923 -3.061643 1.57904
H  -1.529379 -0.445067 -1.779134
H  -4.849758 2.96923 1.608383
H  -3.279865 2.540245 2.297029
H  0.001244 -4.209943 1.008996
H  0.528576 -1.599735 -2.353602
H  -1.257975 3.1991 1.266911
H  -4.950348 3.788956 -0.810519
H  -3.753639 5.038482 -2.572976
H  -1.298828 5.310637 -2.464413
H  2.285661 4.879073 0.91084
H  -0.033728 1.808566 -0.991636
H  3.846807 3.163566 1.758384
H  1.502951 0.111884 -0.122294
H  3.456979 0.768846 1.259645
elementType: Br F O C H
totalener: -3928.09919956 hartree
nucrepener: 3506.88107568 hartree
electener: -7434.98027524 hartree
twoeener: 4974.79273866 hartree
cpcmener: -0.02602016 hartree
kineticenergy: 3918.75955232 hartree
xcener: -198.374089054115 hartree
chargesum: -0.0000000
charge: -0.084976 -0.156814 -0.148046 -0.385420 -0.278021 -0.343794 0.431223 -0.067151 -0.054424 -0.358621 -0.378471 -0.157582 -0.239555 0.052002 -0.150170 -0.190327 0.181417 0.022930 -0.198245 -0.252974 0.278186 -0.117751 -0.253789 0.437086 0.318301 -0.268664 -0.253822 -0.102491 -0.039256 -0.223519 0.103516 0.094536 0.100886 0.112475 0.096837 0.102080 0.111574 0.097931 0.149689 0.151755 0.110409 0.102699 0.151613 0.154475 0.148408 0.145523 0.161429 0.148671 0.146424 0.165959 0.161321 0.117456 0.147071
qa: -0.0850 -0.1568 -0.1480 -0.3854 -0.2780 -0.3438 0.4312 -0.0672 -0.0544 -0.3586 -0.3785 -0.1576 -0.2396 0.0520 -0.1502 -0.1903 0.1814 0.0229 -0.1982 -0.2530 0.2782 -0.1178 -0.2538 0.4371 0.3183 -0.2687 -0.2538 -0.1025 -0.0393 -0.2235 0.1035 0.0945 0.1009 0.1125 0.0968 0.1021 0.1116 0.0979 0.1497 0.1518 0.1104 0.1027 0.1516 0.1545 0.1484 0.1455 0.1614 0.1487 0.1464 0.1660 0.1613 0.1175 0.1471
va: 1.1708 1.1292 1.1483 1.9274 2.0996 2.0687 3.4777 3.9896 3.6355 3.9336 3.9371 3.9397 3.9789 3.9063 4.0197 3.9779 3.7297 3.5152 3.8603 3.9713 3.7076 3.8841 4.0161 4.5473 3.6801 4.0269 3.9519 3.8926 3.7858 3.9598 1.0027 0.9859 1.0038 1.0001 1.0134 0.9996 0.9988 1.0188 0.9970 0.9977 0.9914 0.9991 1.0037 1.0065 1.0038 1.0034 0.9870 1.0054 1.0079 0.9909 0.9877 0.9976 0.9978
dispcorr: -0.031533951 hartree
energy: -3928.130733506557
dipole: -74.42614 73.38139 -1.04474 49.07981 -48.87452 0.20528 -5.09048 5.54471 0.45422
magnitude: 1.15756 au
magnitude: 2.94229 debye
