program: Orca
programVersion: 5.0.2
elementType: Br F F O O O C C C C C C C C C C C C C C C C C C C C C C C C H H H H H H H H H H H H H H H H H H H H H H H
charge: 0
multiplicity: 1
keywords: wb97x-d3
keywords: def2-TZVPP
keywords: def2/J RIJCOSX
keywords: DEFGRID2
keywords: scfconv7
keywords: smallprint printgap noloewdin
keywords: NOSOSCF
formula: C24H23BrF2O3
InChI: InChI=1/C24H23BrF2O3/c1-23(2,19-11-13-21(14-12-19)30-24(25,26)27)17-28-16-18-7-6-10-22(15-18)29-20-8-4-3-5-9-20/h3-15H,16-17H2,1-2H3
53 atoms
Br 2.778017 -2.435021 -1.907655
F  1.633416 -4.856208 -1.791674
F  3.55386 -4.784722 -0.847123
O  -3.823219 1.234743 0.431973
O  1.897554 -3.962341 0.232813
O  -0.348862 4.866453 0.803993
C  -2.457783 -0.474855 1.433676
C  -2.747631 0.355273 0.174201
C  -1.283559 -1.389235 1.103608
C  -3.674555 -1.331245 1.807714
C  -2.137703 0.460887 2.599964
C  -1.406248 -2.348409 0.096307
C  -0.068048 -1.324603 1.78043
C  -4.149746 2.092778 -0.630469
C  -0.371664 -3.210699 -0.229047
C  0.98625 -2.169282 1.463246
C  0.82438 -3.104717 0.460732
C  -3.145352 3.194701 -0.866211
C  -2.228039 3.549589 0.111826
C  -3.147031 3.882538 -2.077964
C  -1.294023 4.54453 -0.144231
C  -2.245299 4.911572 -2.299815
C  -1.296643 5.242093 -1.339687
C  2.414056 -4.120236 -0.989265
C  0.380301 3.833005 1.342729
C  0.818722 2.764605 0.567355
C  0.700146 3.9076 2.690522
C  1.574036 1.762657 1.158018
C  1.464863 2.901102 3.265868
C  1.898092 1.822537 2.507387
H  -1.840462 0.906559 -0.106803
H  -3.000925 -0.299707 -0.669989
H  -3.989144 -1.978151 0.987946
H  -3.446232 -1.966503 2.66473
H  -4.526873 -0.708907 2.081399
H  -2.997643 1.084337 2.839964
H  -1.299074 1.125332 2.378593
H  -1.892585 -0.102045 3.50193
H  -2.33367 -2.448781 -0.452516
H  0.085376 -0.606586 2.572819
H  -4.295176 1.532119 -1.563013
H  -5.116884 2.535809 -0.378424
H  -0.525207 -3.95338 -0.998692
H  1.923903 -2.097484 1.999198
H  -2.217171 3.041199 1.068198
H  -3.856224 3.609797 -2.850305
H  -2.257787 5.445393 -3.240986
H  -0.565993 6.019253 -1.5231
H  0.579511 2.709396 -0.48708
H  0.35439 4.745105 3.283251
H  1.911346 0.929869 0.554526
H  1.713894 2.960345 4.317278
H  2.484916 1.03536 2.961652
elementType: Br F O C H
totalener: -3928.09944778 hartree
nucrepener: 3481.36807388 hartree
electener: -7409.46752166 hartree
twoeener: 4949.44434143 hartree
cpcmener: -0.02539151 hartree
kineticenergy: 3918.76760957 hartree
xcener: -198.379720925133 hartree
chargesum: 0.0000000
charge: -0.075254 -0.159123 -0.150155 -0.392221 -0.268464 -0.349950 0.467672 -0.116091 -0.031624 -0.352541 -0.368920 -0.216384 -0.231755 0.054375 -0.139532 -0.139187 0.131962 0.056422 -0.236235 -0.247056 0.248145 -0.120194 -0.241516 0.425763 0.263931 -0.177171 -0.221349 -0.143368 -0.124361 -0.205239 0.116734 0.126687 0.102846 0.109899 0.096997 0.102813 0.045846 0.119850 0.145614 0.157206 0.102374 0.113032 0.158150 0.150037 0.177285 0.143864 0.160241 0.148730 0.155258 0.147322 0.156562 0.160652 0.161422
qa: -0.0753 -0.1591 -0.1502 -0.3922 -0.2685 -0.3499 0.4677 -0.1161 -0.0316 -0.3525 -0.3689 -0.2164 -0.2318 0.0544 -0.1395 -0.1392 0.1320 0.0564 -0.2362 -0.2471 0.2481 -0.1202 -0.2415 0.4258 0.2639 -0.1772 -0.2213 -0.1434 -0.1244 -0.2052 0.1167 0.1267 0.1028 0.1099 0.0970 0.1028 0.0458 0.1199 0.1456 0.1572 0.1024 0.1130 0.1582 0.1500 0.1773 0.1439 0.1602 0.1487 0.1553 0.1473 0.1566 0.1607 0.1614
va: 1.1808 1.1298 1.1444 1.9182 2.1019 2.0517 3.4223 3.9356 3.5620 3.9357 3.9380 4.0645 3.9251 3.9159 3.9911 3.9827 3.7996 3.5455 3.9280 3.9852 3.7379 3.8710 4.0121 4.5669 3.6902 3.8358 3.9817 3.8228 3.8797 3.8461 0.9782 1.0038 1.0025 1.0006 1.0128 1.0198 1.0200 1.0030 1.0044 0.9884 0.9957 0.9906 1.0079 1.0058 0.9874 0.9998 0.9876 1.0046 0.9987 1.0065 0.9914 0.9875 0.9900
dispcorr: -0.032106797 hartree
energy: -3928.131554578102
dipole: -63.60163 62.57755 -1.02408 53.86800 -53.77861 0.08939 37.77238 -38.01745 -0.24507
magnitude: 1.05678 au
magnitude: 2.68612 debye
