program: Orca
programVersion: 5.0.2
elementType: Br F F O O O C C C C C C C C C C C C C C C C C C C C C C C C H H H H H H H H H H H H H H H H H H H H H H H
charge: 0
multiplicity: 1
keywords: wb97x-d3
keywords: def2-TZVPP
keywords: def2/J RIJCOSX
keywords: DEFGRID2
keywords: scfconv7
keywords: smallprint printgap noloewdin
keywords: NOSOSCF
formula: C24H23BrF2O3
InChI: InChI=1/C24H23BrF2O3/c1-23(2,19-11-13-21(14-12-19)30-24(25,26)27)17-28-16-18-7-6-10-22(15-18)29-20-8-4-3-5-9-20/h3-15H,16-17H2,1-2H3
53 atoms
Br 3.851528 -2.247258 1.407187
F  1.982532 -0.326835 1.32409
F  2.667198 -0.950923 -0.60874
O  -3.904322 1.350968 -1.307484
O  1.32442 -2.30414 0.539763
O  0.696404 2.533959 0.908309
C  -3.944187 -1.072014 -1.286009
C  -4.538715 0.22539 -0.737437
C  -2.494574 -1.261583 -0.843443
C  -4.103379 -1.102156 -2.806203
C  -4.766895 -2.223013 -0.689149
C  -2.140874 -1.112525 0.50048
C  -1.504076 -1.701882 -1.719299
C  -3.997221 2.520412 -0.510826
C  -0.867564 -1.410326 0.958741
C  -0.223304 -2.015065 -1.27814
C  0.076756 -1.87806 0.061966
C  -2.969536 2.474169 0.58617
C  -1.630723 2.614745 0.232276
C  -3.307297 2.174864 1.899561
C  -0.638051 2.39988 1.174356
C  -2.306116 1.991267 2.845983
C  -0.971764 2.08233 2.487094
C  2.314389 -1.401849 0.599094
C  1.228401 2.307747 -0.333925
C  0.700009 1.406718 -1.249458
C  2.400239 2.9968 -0.621452
C  1.349767 1.211368 -2.459722
C  3.046041 2.779986 -1.828924
C  2.520885 1.892516 -2.759039
H  -5.612264 0.244932 -0.970147
H  -4.461788 0.237015 0.355176
H  -3.852936 -2.081699 -3.215572
H  -5.14308 -0.901867 -3.070713
H  -3.482718 -0.362598 -3.312647
H  -4.741751 -2.215782 0.401868
H  -4.383583 -3.187118 -1.025206
H  -5.811286 -2.152231 -0.999838
H  -2.871277 -0.782598 1.227882
H  -1.718266 -1.831955 -2.77085
H  -3.810684 3.365758 -1.175935
H  -5.005075 2.642443 -0.097957
H  -0.632738 -1.313195 2.010552
H  0.515306 -2.386547 -1.976322
H  -1.38235 2.883351 -0.786746
H  -4.348082 2.07555 2.181634
H  -2.565967 1.754802 3.869363
H  -0.19063 1.920551 3.21901
H  -0.199311 0.84577 -1.034333
H  2.808561 3.689192 0.103889
H  0.933206 0.507191 -3.168608
H  3.962721 3.31382 -2.042701
H  3.022871 1.729779 -3.703282
elementType: Br F O C H
totalener: -3928.09661690 hartree
nucrepener: 3678.59802244 hartree
electener: -7606.69463934 hartree
twoeener: 5148.73295204 hartree
cpcmener: -0.02866783 hartree
kineticenergy: 3918.80026409 hartree
xcener: -198.383485644373 hartree
chargesum: 0.0000000
charge: -0.044691 -0.164482 -0.158418 -0.395265 -0.294048 -0.334931 0.421508 -0.087214 -0.068402 -0.385018 -0.333769 -0.272229 -0.125038 0.072002 -0.169807 -0.230645 0.243496 0.072772 -0.308030 -0.257729 0.366344 -0.074573 -0.310462 0.430914 0.317323 -0.177877 -0.243138 -0.190025 -0.144309 -0.164768 0.111703 0.112019 0.102705 0.105369 0.105483 0.104108 0.108810 0.104636 0.153533 0.143705 0.109180 0.101621 0.149088 0.148673 0.148334 0.148258 0.159001 0.142966 0.131518 0.145086 0.154457 0.160274 0.159980
qa: -0.0447 -0.1645 -0.1584 -0.3953 -0.2940 -0.3349 0.4215 -0.0872 -0.0684 -0.3850 -0.3338 -0.2722 -0.1250 0.0720 -0.1698 -0.2306 0.2435 0.0728 -0.3080 -0.2577 0.3663 -0.0746 -0.3105 0.4309 0.3173 -0.1779 -0.2431 -0.1900 -0.1443 -0.1648 0.1117 0.1120 0.1027 0.1054 0.1055 0.1041 0.1088 0.1046 0.1535 0.1437 0.1092 0.1016 0.1491 0.1487 0.1483 0.1483 0.1590 0.1430 0.1315 0.1451 0.1545 0.1603 0.1600
va: 1.1872 1.1315 1.1365 1.9150 2.1042 2.0610 3.4897 3.9543 3.6280 3.9387 3.9201 3.9721 3.8229 3.9001 3.9699 4.0131 3.6599 3.5084 3.9677 3.9000 3.5785 3.8405 3.9882 4.5303 3.5893 3.7780 3.9804 3.9084 3.9007 3.8945 1.0060 0.9812 0.9999 1.0053 1.0088 1.0007 1.0029 1.0044 0.9928 0.9991 0.9927 0.9950 1.0046 1.0056 1.0062 1.0019 0.9870 1.0114 0.9936 1.0095 0.9950 0.9881 0.9892
dispcorr: -0.036043323 hartree
energy: -3928.132660222353
dipole: -85.93266 83.84245 -2.09021 29.65095 -29.94483 -0.29389 -29.13175 29.00723 -0.12452
magnitude: 2.11444 au
magnitude: 5.37447 debye
