program: Gaussian 09
title: 000067538
version: EM64L-G09RevD.01
frameworkgroup: C1[X(C16H23NO3)]
method: RPBEPBE
basis: SDD
operation: Freq
keyword: #p
keyword: freq=noraman
keyword: PBEPBE/SDD
title: #p freq=noraman PBEPBE/SDD
converged: YES YES NO NO
title: Mulliken charges:
elementType: O O O N C C C C C C C C C C C C C C C C H H H H H H H H H H H H H H H H H H H H H H H
charge: -0.261815 -0.292515 -0.259116 -0.121391 -0.386126 -0.341003 0.196758 -0.395261 0.237206 0.550033 -0.639875 -0.659605 0.184133 -0.499025 -0.310887 -0.511925 -0.627723 -0.023655 -0.536232 -0.587677 0.231309 0.228285 0.261627 0.204513 0.225486 0.232204 0.223235 0.224471 0.220915 0.203016 0.253155 0.219904 0.267579 0.235976 0.227970 0.220195 0.210561 0.229988 0.308711 0.202873 0.222092 0.217506 0.214130
chargesum: 0.00000
title: Mulliken charges with hydrogens summed into heavy atoms:
elementType: O O O N C C C C C C C C C C C C C C C C
charge: -0.261815 -0.292515 -0.259116 -0.121391 0.073468 0.125137 0.196758 0.062430 0.237206 0.550033 0.028746 0.016470 0.184133 -0.231446 -0.074911 -0.283956 -0.196967 0.206334 0.197444 -0.156041
polarizability: 2.78633646e+02 4.24301994e+00 1.96433642e+02 -5.37022486e+00 -7.13965367e+00 1.23768548e+02
1716.lowfreq: -7.1073 -3.6966 -0.0011 -0.0010 -0.0009 3.8047 15.9351 24.2487 32.5140
frequency: 15.6130 23.9432 32.5105 44.1919 58.8065 67.8970 69.8851 82.7731 94.2773 113.3564 129.6255 135.5944 170.6472 173.9330 180.8172 189.0887 208.1381 226.1752 234.5481 299.4284 314.8379 320.5379 339.7760 369.6163 383.1693 395.5152 436.7259 460.6613 467.4752 482.1170 517.9560 570.6473 596.1367 598.8388 616.8312 644.3670 708.7714 721.9420 748.6313 776.3760 777.5860 793.4221 816.2730 871.4926 893.7995 898.9768 917.9967 921.4126 933.7164 941.4937 945.1984 995.1010 999.5749 1009.3087 1012.4845 1033.2978 1071.5444 1080.6730 1097.0502 1104.5383 1112.3298 1118.4865 1140.8203 1155.7325 1161.0400 1203.5257 1209.4833 1212.3950 1217.2792 1249.3759 1261.4979 1264.3231 1285.4147 1299.1760 1303.7215 1335.0921 1344.4659 1358.9405 1382.4981 1384.7624 1388.6776 1404.5915 1417.0346 1424.2344 1444.0680 1453.9633 1457.2317 1457.5934 1462.6542 1467.5445 1469.1931 1477.7506 1482.7244 1489.7741 1491.9755 1498.2182 1578.7367 1604.3824 1612.6711 1654.4522 2931.0185 2965.6078 2974.1504 2983.9402 2986.7821 2993.1714 2998.7803 3007.4335 3017.2117 3052.3312 3068.0602 3082.2311 3085.1380 3085.6664 3088.1002 3092.8521 3095.8680 3102.6696 3125.7242 3131.3081 3150.3552 3154.3144 3194.9503
redmass: 4.1296 4.0753 3.6548 3.7192 2.9361 3.3362 3.1654 3.3555 3.3256 3.4006 3.1682 1.5974 2.2318 2.3146 2.6424 2.8404 1.1306 2.5549 1.4899 3.7248 2.8551 3.1618 3.3750 3.0004 3.7065 2.7056 3.4377 3.6416 4.6081 2.9838 2.7996 3.9620 3.2820 2.7075 3.8904 3.0214 4.8292 3.6402 2.9764 1.1524 1.3539 1.4712 3.2508 2.5727 2.0369 2.4501 1.4559 1.4115 1.9954 2.1839 1.4762 3.3471 1.8845 2.8697 1.3111 3.6084 2.0633 1.8524 1.7640 1.8554 1.2752 1.9439 2.0476 1.4524 1.7100 1.7489 1.4417 2.1227 1.2822 1.7216 1.7852 1.6826 1.2862 1.3243 1.6986 1.3879 1.3135 1.2898 5.5646 1.2170 1.2155 2.4021 2.3651 1.1927 1.3265 1.0955 1.0596 1.1269 1.1494 1.0734 1.0464 1.0661 1.0567 1.2222 1.4240 1.3746 7.3012 7.4218 6.7090 4.6829 1.0563 1.0592 1.0351 1.0361 1.0354 1.0996 1.0653 1.0632 1.1000 1.0995 1.0995 1.0635 1.0992 1.0994 1.0966 1.1012 1.0903 1.1020 1.0876 1.1061 1.0920 1.0941 1.1143
irintensity: 0.3642 0.3912 0.1890 0.4189 0.9373 0.4441 0.1199 4.3057 7.9229 0.2996 0.9603 0.9184 7.1221 1.8040 2.4175 1.2175 0.9800 2.5900 1.0109 2.1858 4.3649 3.9170 12.4114 2.6321 3.1223 0.7814 9.1480 5.2865 2.0850 0.6410 0.2816 12.3026 2.4728 12.6970 7.8892 5.0029 4.9351 0.5603 14.9797 4.5050 8.6610 45.1768 21.5807 6.9314 32.0036 12.2757 17.4847 11.1365 16.4272 8.5047 58.9289 59.7062 0.0926 23.7434 10.6294 40.8971 14.7407 10.0073 21.1412 76.4107 9.1246 68.6205 50.1102 4.6118 10.3109 74.6515 62.5534 16.5651 9.8865 217.2712 43.3339 36.3610 5.7435 25.1033 18.3902 8.9857 3.5772 8.0487 13.2031 15.1909 28.8214 18.5392 124.6479 6.4883 3.4767 32.5838 24.5259 33.0376 10.0685 17.4172 19.0326 13.4218 12.1678 80.9866 80.9742 48.7164 8.1763 254.2947 54.8068 20.8321 62.7997 35.9655 79.4252 26.1807 20.9788 37.8978 27.6838 37.2764 15.8600 11.7356 11.5417 17.9624 23.2118 52.2636 35.6017 45.7393 9.2417 31.1436 17.0350 7.5866 16.6109 8.5502 29.3759
temp: 298.150 k
press: 1.00000 atm
elementType: 8 8 8 7 6 6 6 6 6 6 6 6 6 6 6 6 6 6 6 6 1 1 1 1 1 1 1 1 1 1 1 1 1 1 1 1 1 1 1 1 1 1 1
symmnumber: 1
zpe: 940519.7 jmol-1
zpe.correction: 0.358225 hartree
zpe.thermalcorrener: 0.380822 hartree
zpe.thermalcorrenthalpy: 0.381766 hartree
zpe.thermalcorrgfe: 0.303504 hartree
zpe.sumelectzpe: -902.336325 hartree
zpe.sumelectthermal: -902.313729 hartree
zpe.sumelectthermalent: -902.312784 hartree
zpe.sumelectthermalfe: -902.391046 hartree
dipole: -4.2736 -4.7231 1.8091
dipole: 6.6215
quadrupole: -100.8854 -117.2123 -122.7431
quadrupole: 9.6240 0.0909 2.4073
quadrupole: 12.7282 -3.5987 -9.1295 9.6240 0.0909 2.4073
hfenergy: -902.6945503 hartree
pointgroup: C01 [X(C16H23N1O3)]
dipole: -1.6090563 1.9803257 -0.5252367 debye
polarizability: 278.0374056|-7.5004306|197.5174107|7.3207996|0.8169491|123.2810197 unknown
InChI: InChI=1S/C16H23NO3/c1-5-8-13-9-10-14(15(11-13)19-4)20-12-16(18)17(6-2)7-3/h5,9-11H,1,6-8,12H2,2-4H3
charge 0 multiplicity 1
43 atoms
O  -0.544397 -0.451981 -0.034519
O  1.54324 -2.33508 0.379466
O  -2.911654 -1.597899 -0.440999
N  -4.095195 0.404584 -0.372271
C  -4.16254 1.883142 -0.327305
C  -5.380148 -0.337745 -0.432652
C  -2.917907 -0.33215 -0.378611
C  -1.607337 0.48783 -0.331305
C  0.785393 0.001898 -0.117332
C  3.537933 0.753004 -0.129593
C  -4.341731 2.445089 1.1014
C  -5.853424 -0.582586 -1.880871
C  1.797315 -0.989981 0.085048
C  3.151371 -0.594106 0.080146
C  1.161871 1.343786 -0.349242
C  2.526734 1.714342 -0.355348
C  5.014532 1.15192 -0.092866
C  5.90573 0.278809 -0.9588
C  0.512425 -3.070642 -0.395534
C  6.998282 -0.395074 -0.519396
H  -3.260096 2.313176 -0.796348
H  -5.013419 2.198205 -0.960935
H  -5.230229 -1.304696 0.076232
H  -6.13454 0.239778 0.133947
H  -1.438279 0.975786 -1.316652
H  -1.651576 1.277217 0.44701
H  -5.256097 2.042112 1.571727
H  -3.485622 2.178928 1.746498
H  -4.427293 3.546944 1.075386
H  -5.988352 0.366488 -2.432206
H  -5.116586 -1.201478 -2.420029
H  -6.820816 -1.117509 -1.881884
H  3.90486 -1.372947 0.23874
H  0.399726 2.114305 -0.504025
H  2.798668 2.761754 -0.531003
H  5.38943 1.119557 0.949705
H  5.102423 2.205862 -0.427102
H  5.614897 0.206247 -2.018006
H  -0.494041 -2.654767 -0.233455
H  0.762659 -3.046883 -1.474112
H  0.580936 -4.103588 -0.020968
H  7.311487 -0.356981 0.531858
H  7.608964 -1.00427 -1.195192
