program: Orca
programVersion: 5.0.2
elementType: Br F F O O O C C C C C C C C C C C C C C C C C C C C C C C C H H H H H H H H H H H H H H H H H H H H H H H
charge: 0
multiplicity: 1
keywords: wb97x-d3
keywords: def2-TZVPP
keywords: def2/J RIJCOSX
keywords: DEFGRID2
keywords: scfconv7
keywords: smallprint printgap noloewdin
keywords: NOSOSCF
formula: C24H23BrF2O3
InChI: InChI=1/C24H23BrF2O3/c1-23(2,19-11-13-21(14-12-19)30-24(25,26)27)17-28-16-18-7-6-10-22(15-18)29-20-8-4-3-5-9-20/h3-15H,16-17H2,1-2H3
53 atoms
Br 2.35208 -3.353382 -1.058546
F  2.940816 -1.209995 0.429156
F  3.59956 -1.035044 -1.6082
O  -4.275973 0.682573 -0.500906
O  1.523927 -0.710992 -1.216099
O  0.486501 2.43399 -0.718295
C  -3.817373 -1.393027 0.633975
C  -4.314972 0.051401 0.760813
C  -2.370212 -1.334821 0.162079
C  -4.715294 -2.176062 -0.324919
C  -3.928752 -2.042077 2.017336
C  -1.359688 -0.951378 1.044154
C  -2.014072 -1.551713 -1.167141
C  -4.359126 2.085999 -0.440448
C  -0.049731 -0.771383 0.628716
C  -0.709733 -1.375355 -1.60562
C  0.257744 -0.976994 -0.7045
C  -3.06691 2.750746 -0.032541
C  -1.845868 2.267724 -0.495531
C  -3.086243 3.882687 0.773424
C  -0.670478 2.925748 -0.168967
C  -1.903309 4.539361 1.087166
C  -0.686753 4.073071 0.615331
C  2.586966 -1.424521 -0.844259
C  1.63599 2.338929 0.018932
C  2.827811 2.377056 -0.694113
C  1.643473 2.140601 1.394374
C  4.031301 2.208174 -0.026502
C  2.856952 1.980763 2.049447
C  4.054173 2.011928 1.348065
H  -5.341266 0.054208 1.153517
H  -3.688944 0.585198 1.487486
H  -4.364939 -3.202992 -0.439436
H  -5.729479 -2.217858 0.074684
H  -4.779917 -1.736018 -1.318884
H  -3.516842 -3.051724 2.007937
H  -4.97606 -2.1145 2.314303
H  -3.413386 -1.477156 2.79425
H  -1.585203 -0.759322 2.084601
H  -2.753581 -1.855168 -1.894465
H  -4.630155 2.420078 -1.445289
H  -5.166535 2.410515 0.227499
H  0.694923 -0.446417 1.341008
H  -0.456662 -1.530381 -2.646312
H  -1.799048 1.385793 -1.123789
H  -4.028786 4.256477 1.154348
H  -1.926308 5.425525 1.707556
H  0.229372 4.596511 0.85713
H  2.809542 2.52893 -1.765885
H  0.720516 2.096462 1.957627
H  4.956344 2.235645 -0.587374
H  2.858798 1.822143 3.119881
H  4.994548 1.882683 1.866771
elementType: Br F O C H
totalener: -3928.10081482 hartree
nucrepener: 3657.55916869 hartree
electener: -7585.65998351 hartree
twoeener: 5127.90023822 hartree
cpcmener: -0.02774262 hartree
kineticenergy: 3918.80093359 hartree
xcener: -198.387136649233 hartree
chargesum: -0.0000000
charge: -0.071862 -0.163278 -0.155255 -0.385624 -0.280452 -0.335275 0.395612 -0.108521 -0.003767 -0.354119 -0.340675 -0.207721 -0.224968 0.068910 -0.164096 -0.133063 0.121395 0.031320 -0.306170 -0.193270 0.295027 -0.139070 -0.220510 0.451542 0.355741 -0.300436 -0.233761 -0.109925 -0.149066 -0.198456 0.108592 0.115019 0.115655 0.104618 0.092794 0.110667 0.104813 0.102611 0.143271 0.143085 0.107092 0.101221 0.162603 0.149982 0.150445 0.143028 0.161075 0.156621 0.143746 0.162582 0.159222 0.161312 0.159739
qa: -0.0719 -0.1633 -0.1553 -0.3856 -0.2805 -0.3353 0.3956 -0.1085 -0.0038 -0.3541 -0.3407 -0.2077 -0.2250 0.0689 -0.1641 -0.1331 0.1214 0.0313 -0.3062 -0.1933 0.2950 -0.1391 -0.2205 0.4515 0.3557 -0.3004 -0.2338 -0.1099 -0.1491 -0.1985 0.1086 0.1150 0.1157 0.1046 0.0928 0.1107 0.1048 0.1026 0.1433 0.1431 0.1071 0.1012 0.1626 0.1500 0.1504 0.1430 0.1611 0.1566 0.1437 0.1626 0.1592 0.1613 0.1597
va: 1.1908 1.1335 1.1410 1.9253 2.0700 2.0281 3.5543 3.9813 3.5461 3.9110 3.9172 4.0150 4.0176 3.8867 3.9904 4.0212 3.6951 3.5910 4.0080 3.9363 3.7262 3.8926 3.9303 4.5382 3.4698 3.9933 3.8679 3.8397 3.9066 3.8940 1.0029 0.9816 0.9991 1.0045 1.0132 1.0010 1.0038 1.0026 1.0056 0.9989 0.9896 0.9973 0.9946 1.0044 1.0079 1.0012 0.9896 0.9973 1.0112 0.9972 0.9875 0.9896 0.9895
dispcorr: -0.034992327 hartree
energy: -3928.135807144204
dipole: -66.43926 64.67635 -1.76292 45.71143 -45.18152 0.52991 24.34161 -22.84114 1.50047
magnitude: 2.37489 au
magnitude: 6.03648 debye
