program: Orca
programVersion: 5.0.2
elementType: Br F F O O O C C C C C C C C C C C C C C C C C C C C C C C C H H H H H H H H H H H H H H H H H H H H H H H
charge: 0
multiplicity: 1
keywords: wb97x-d3
keywords: def2-TZVPP
keywords: def2/J RIJCOSX
keywords: DEFGRID2
keywords: scfconv7
keywords: smallprint printgap noloewdin
keywords: NOSOSCF
formula: C24H23BrF2O3
InChI: InChI=1/C24H23BrF2O3/c1-23(2,19-11-13-21(14-12-19)30-24(25,26)27)17-28-16-18-7-6-10-22(15-18)29-20-8-4-3-5-9-20/h3-15H,16-17H2,1-2H3
53 atoms
Br 1.772033 -1.373967 2.150692
F  3.147104 -1.651712 -0.137196
F  3.289519 -3.359795 1.150759
O  -3.993911 0.256255 0.507522
O  1.490757 -3.128968 0.016239
O  1.02743 3.261315 0.560543
C  -3.528586 -0.95847 -1.606321
C  -3.767606 0.377646 -0.879462
C  -2.190574 -1.554186 -1.186676
C  -3.508161 -0.650865 -3.109548
C  -4.701007 -1.897785 -1.330875
C  -2.085739 -2.744588 -0.472587
C  -1.003361 -0.885805 -1.493248
C  -2.869744 0.377727 1.353776
C  -0.854721 -3.237876 -0.06245
C  0.237461 -1.365676 -1.107271
C  0.296419 -2.54334 -0.379077
C  -2.227558 1.73883 1.285688
C  -0.889371 1.859846 0.939673
C  -2.970709 2.886709 1.557311
C  -0.298926 3.11666 0.866697
C  -2.369713 4.132856 1.49648
C  -1.031034 4.258601 1.144281
C  2.441685 -2.458343 0.666697
C  1.546377 2.575848 -0.503831
C  2.836205 2.080791 -0.371364
C  0.846319 2.41776 -1.694565
C  3.432089 1.429807 -1.441745
C  1.451486 1.75554 -2.75324
C  2.742893 1.25887 -2.634497
H  -2.946058 1.072273 -1.094359
H  -4.672764 0.828699 -1.298669
H  -2.752325 0.088628 -3.377562
H  -3.308077 -1.553326 -3.689216
H  -4.474426 -0.257456 -3.431768
H  -4.818687 -2.137776 -0.274227
H  -4.597112 -2.837529 -1.876489
H  -5.631348 -1.43183 -1.6615
H  -2.968748 -3.309323 -0.207975
H  -1.029534 0.04363 -2.047845
H  -3.248235 0.199237 2.363381
H  -2.117383 -0.392963 1.158863
H  -0.795794 -4.160277 0.501346
H  1.126165 -0.816979 -1.389706
H  -0.309647 0.969711 0.722766
H  -4.017133 2.805528 1.825452
H  -2.945774 5.022497 1.716514
H  -0.562076 5.232838 1.086245
H  3.368894 2.208054 0.562725
H  -0.15664 2.81121 -1.805519
H  4.439797 1.04906 -1.336534
H  0.906475 1.63392 -3.680739
H  3.207964 0.745259 -3.465615
elementType: Br F O C H
totalener: -3928.11175302 hartree
nucrepener: 3696.58380375 hartree
electener: -7624.69555677 hartree
twoeener: 5164.66696348 hartree
cpcmener: -0.02080997 hartree
kineticenergy: 3918.77542852 hartree
xcener: -198.382697048792 hartree
chargesum: -0.0000000
charge: -0.076601 -0.153415 -0.150241 -0.383009 -0.262959 -0.334299 0.375937 -0.077129 -0.058664 -0.343351 -0.374530 -0.177385 -0.243090 0.127042 -0.120731 -0.122494 0.126030 -0.011492 -0.140278 -0.238461 0.240428 -0.127316 -0.223530 0.428360 0.295521 -0.232765 -0.197841 -0.141858 -0.161104 -0.155771 0.104333 0.115430 0.102090 0.108371 0.103700 0.095335 0.110772 0.104001 0.142552 0.145349 0.114805 0.074030 0.147160 0.146576 0.097797 0.138396 0.156327 0.145645 0.139404 0.156705 0.155856 0.156306 0.154061
qa: -0.0766 -0.1534 -0.1502 -0.3830 -0.2630 -0.3343 0.3759 -0.0771 -0.0587 -0.3434 -0.3745 -0.1774 -0.2431 0.1270 -0.1207 -0.1225 0.1260 -0.0115 -0.1403 -0.2385 0.2404 -0.1273 -0.2235 0.4284 0.2955 -0.2328 -0.1978 -0.1419 -0.1611 -0.1558 0.1043 0.1154 0.1021 0.1084 0.1037 0.0953 0.1108 0.1040 0.1426 0.1453 0.1148 0.0740 0.1472 0.1466 0.0978 0.1384 0.1563 0.1456 0.1394 0.1567 0.1559 0.1563 0.1541
va: 1.1741 1.1273 1.1451 1.9364 2.1220 2.0773 3.5775 3.9581 3.6080 3.9317 3.9255 3.9342 3.9688 3.8530 4.0100 3.8652 3.8337 3.5988 3.8810 3.9758 3.7387 3.9027 3.9907 4.5535 3.6667 3.9744 3.8393 3.8441 3.8491 3.8404 0.9918 1.0073 0.9994 1.0024 1.0046 1.0138 0.9994 1.0052 0.9985 0.9927 0.9914 0.9908 1.0044 1.0141 1.0087 1.0117 0.9889 1.0060 1.0109 0.9988 0.9899 0.9932 0.9916
dispcorr: -0.035731079 hartree
energy: -3928.147484102413
dipole: -57.93093 56.84727 -1.08366 25.77131 -25.64622 0.12510 -41.34203 40.25370 -1.08833
magnitude: 1.54092 au
magnitude: 3.91671 debye
