program: Orca
programVersion: 5.0.2
elementType: Br F F O O O C C C C C C C C C C C C C C C C C C C C C C C C H H H H H H H H H H H H H H H H H H H H H H H
charge: 0
multiplicity: 1
keywords: wb97x-d3
keywords: def2-TZVPP
keywords: def2/J RIJCOSX
keywords: DEFGRID2
keywords: scfconv7
keywords: smallprint printgap noloewdin
keywords: NOSOSCF
formula: C24H23BrF2O3
InChI: InChI=1/C24H23BrF2O3/c1-23(2,19-11-13-21(14-12-19)30-24(25,26)27)17-28-16-18-7-6-10-22(15-18)29-20-8-4-3-5-9-20/h3-15H,16-17H2,1-2H3
53 atoms
Br 4.170115 -2.612847 -0.747154
F  1.883238 -3.673525 0.168695
F  2.655142 -2.103508 1.40385
O  -3.956628 0.691025 -0.956457
O  1.7130 -1.572916 -0.540573
O  0.025213 2.772227 1.456582
C  -3.955711 -1.438176 0.145229
C  -4.369767 0.033395 0.219038
C  -2.443347 -1.50904 -0.036094
C  -4.715804 -2.126364 -0.988922
C  -4.361504 -2.104546 1.464251
C  -1.595498 -1.028262 0.963658
C  -1.851597 -2.010241 -1.191631
C  -4.213232 2.070066 -0.961392
C  -0.216226 -1.048825 0.829588
C  -0.472118 -2.051133 -1.341776
C  0.332218 -1.570382 -0.329272
C  -3.332732 2.85612 -0.019726
C  -2.030094 2.441107 0.238378
C  -3.814239 4.014864 0.580412
C  -1.226074 3.18751 1.088578
C  -2.997719 4.759407 1.418854
C  -1.697622 4.352668 1.676561
C  2.451851 -2.464356 0.127843
C  0.983049 2.427678 0.549981
C  0.920885 2.72358 -0.805896
C  2.097378 1.780179 1.076615
C  1.975664 2.348632 -1.6299
C  3.143364 1.42267 0.24297
C  3.087317 1.69762 -1.117684
H  -5.461739 0.10136 0.332818
H  -3.92813 0.499512 1.10962
H  -4.461116 -3.185657 -1.055445
H  -5.789296 -2.062623 -0.801715
H  -4.530496 -1.677299 -1.964586
H  -4.078682 -3.158201 1.469958
H  -5.443552 -2.052311 1.601768
H  -3.900094 -1.632267 2.332222
H  -2.007848 -0.611016 1.873927
H  -2.45819 -2.38654 -2.003307
H  -4.038158 2.408875 -1.986604
H  -5.267639 2.280861 -0.737099
H  0.406424 -0.644962 1.61631
H  -0.031247 -2.444388 -2.2489
H  -1.649206 1.532128 -0.211144
H  -4.833968 4.332694 0.397907
H  -3.377192 5.659981 1.88419
H  -1.05848 4.921334 2.340236
H  0.072023 3.242163 -1.231402
H  2.141276 1.567768 2.1378
H  1.92009 2.577308 -2.686595
H  4.008709 0.926123 0.662452
H  3.902287 1.410334 -1.768532
elementType: Br F O C H
totalener: -3928.11384993 hartree
nucrepener: 3569.29523554 hartree
electener: -7497.40908546 hartree
twoeener: 5038.89083129 hartree
cpcmener: -0.02272351 hartree
kineticenergy: 3918.79638608 hartree
xcener: -198.382241555322 hartree
chargesum: 0.0000000
charge: -0.046016 -0.159462 -0.167696 -0.368790 -0.293777 -0.323194 0.397718 -0.097448 -0.046319 -0.367186 -0.334960 -0.244892 -0.159917 0.063159 -0.178476 -0.179810 0.216666 0.051115 -0.299317 -0.232104 0.349839 -0.106102 -0.266881 0.434484 0.332411 -0.215357 -0.277871 -0.149097 -0.121356 -0.179579 0.110587 0.111766 0.110926 0.102395 0.097451 0.108786 0.103607 0.101475 0.138311 0.144826 0.106426 0.096604 0.158359 0.146026 0.142348 0.139551 0.156757 0.143496 0.155373 0.142302 0.156932 0.146605 0.149308
qa: -0.0460 -0.1595 -0.1677 -0.3688 -0.2938 -0.3232 0.3977 -0.0974 -0.0463 -0.3672 -0.3350 -0.2449 -0.1599 0.0632 -0.1785 -0.1798 0.2167 0.0511 -0.2993 -0.2321 0.3498 -0.1061 -0.2669 0.4345 0.3324 -0.2154 -0.2779 -0.1491 -0.1214 -0.1796 0.1106 0.1118 0.1109 0.1024 0.0975 0.1088 0.1036 0.1015 0.1383 0.1448 0.1064 0.0966 0.1584 0.1460 0.1423 0.1396 0.1568 0.1435 0.1554 0.1423 0.1569 0.1466 0.1493
va: 1.1859 1.1338 1.1289 1.9310 2.0795 2.0724 3.5703 3.9389 3.6104 3.9221 3.9238 3.9966 3.9471 3.9053 4.0257 4.1130 3.6471 3.5911 3.9505 3.9746 3.6080 3.8740 4.0421 4.5445 3.6333 3.8833 3.9317 3.9088 3.8453 3.8819 1.0042 0.9824 0.9994 1.0063 1.0111 1.0027 1.0031 1.0022 1.0089 0.9965 0.9892 0.9978 1.0007 1.0050 1.0102 1.0024 0.9892 1.0077 0.9986 1.0119 0.9904 0.9952 0.9950
dispcorr: -0.033111557 hartree
energy: -3928.146961483547
dipole: -89.60096 87.61260 -1.98836 41.65314 -41.12033 0.53282 6.54321 -6.60362 -0.06041
magnitude: 2.05939 au
magnitude: 5.23456 debye
