program: Orca
programVersion: 5.0.2
elementType: Br F F O O O C C C C C C C C C C C C C C C C C C C C C C C C H H H H H H H H H H H H H H H H H H H H H H H
charge: 0
multiplicity: 1
keywords: wb97x-d3
keywords: def2-TZVPP
keywords: def2/J RIJCOSX
keywords: DEFGRID2
keywords: scfconv7
keywords: smallprint printgap noloewdin
keywords: NOSOSCF
formula: C24H23BrF2O3
InChI: InChI=1/C24H23BrF2O3/c1-23(2,19-11-13-21(14-12-19)30-24(25,26)27)17-28-16-18-7-6-10-22(15-18)29-20-8-4-3-5-9-20/h3-15H,16-17H2,1-2H3
53 atoms
Br -0.30607 -5.422621 1.667429
F  2.272776 -5.044039 1.01595
F  0.958722 -5.093955 -0.677668
O  -2.278073 1.326695 -1.678837
O  1.118594 -3.288518 0.610158
O  2.179699 4.508831 0.538715
C  -3.399533 0.156081 0.094714
C  -2.843515 1.495264 -0.400114
C  -2.234164 -0.818324 0.224959
C  -4.480065 -0.343218 -0.865658
C  -4.058773 0.396009 1.457482
C  -2.028174 -1.862091 -0.671933
C  -1.284807 -0.648162 1.234844
C  -1.407832 2.362329 -2.063258
C  -0.93179 -2.710656 -0.578472
C  -0.193881 -1.490496 1.358576
C  -0.025815 -2.5200 0.448853
C  -0.088993 2.314563 -1.331976
C  0.430339 3.461018 -0.747061
C  0.614949 1.11528 -1.233396
C  1.654987 3.41226 -0.088953
C  1.823572 1.07409 -0.558243
C  2.356834 2.22221 0.012794
C  1.097386 -4.619877 0.568523
C  2.13321 5.730979 -0.073375
C  1.896543 6.835353 0.733353
C  2.366147 5.886482 -1.435088
C  1.891701 8.10413 0.171234
C  2.347283 7.160101 -1.984623
C  2.109421 8.27302 -1.18902
H  -3.651295 2.240695 -0.435509
H  -2.098816 1.865519 0.316927
H  -4.125794 -0.477586 -1.887159
H  -4.898641 -1.293985 -0.530145
H  -5.298995 0.377792 -0.902259
H  -3.38145 0.846021 2.184056
H  -4.42702 -0.539231 1.881614
H  -4.911366 1.0696 1.353057
H  -2.723843 -2.038007 -1.480205
H  -1.381412 0.159312 1.949037
H  -1.237877 2.234278 -3.135497
H  -1.87326 3.348125 -1.932372
H  -0.809522 -3.490203 -1.317128
H  0.526516 -1.34216 2.15294
H  -0.126743 4.38968 -0.800423
H  0.218917 0.21163 -1.68015
H  2.3663 0.14067 -0.480409
H  3.30496 2.193837 0.534972
H  1.721061 6.700418 1.793407
H  2.564514 5.028786 -2.06549
H  1.707555 8.963463 0.80297
H  2.526713 7.279891 -3.045373
H  2.097468 9.263016 -1.625391
elementType: Br F O C H
totalener: -3928.11518321 hartree
nucrepener: 3357.20691746 hartree
electener: -7285.32210067 hartree
twoeener: 4826.03517857 hartree
cpcmener: -0.02247744 hartree
kineticenergy: 3918.79074508 hartree
xcener: -198.381056688253 hartree
chargesum: -0.0000000
charge: -0.075978 -0.149039 -0.158982 -0.366157 -0.264241 -0.331964 0.394927 -0.106463 -0.037363 -0.362193 -0.336924 -0.210558 -0.166508 0.065230 -0.127198 -0.235332 0.183608 0.023566 -0.158410 -0.265596 0.244530 -0.130121 -0.229866 0.417535 0.272154 -0.246143 -0.179366 -0.123588 -0.148834 -0.185081 0.106374 0.107911 0.094665 0.114781 0.102917 0.101118 0.109683 0.103137 0.143109 0.141817 0.108036 0.094583 0.153811 0.147299 0.140351 0.148530 0.156687 0.146101 0.145155 0.154570 0.157460 0.158900 0.157359
qa: -0.0760 -0.1490 -0.1590 -0.3662 -0.2642 -0.3320 0.3949 -0.1065 -0.0374 -0.3622 -0.3369 -0.2106 -0.1665 0.0652 -0.1272 -0.2353 0.1836 0.0236 -0.1584 -0.2656 0.2445 -0.1301 -0.2299 0.4175 0.2722 -0.2461 -0.1794 -0.1236 -0.1488 -0.1851 0.1064 0.1079 0.0947 0.1148 0.1029 0.1011 0.1097 0.1031 0.1431 0.1418 0.1080 0.0946 0.1538 0.1473 0.1404 0.1485 0.1567 0.1461 0.1452 0.1546 0.1575 0.1589 0.1574
va: 1.1796 1.1451 1.1290 1.9382 2.0956 2.0685 3.5534 4.0034 3.6079 3.9183 3.9199 4.0119 3.9268 3.9015 3.9785 4.0233 3.7226 3.5780 3.8831 3.9412 3.7382 3.8762 4.0233 4.5856 3.7065 4.0044 3.8937 3.8875 3.8959 3.9033 1.0024 0.9806 1.0130 0.9988 1.0050 1.0035 1.0013 1.0042 1.0002 1.0023 0.9888 0.9986 1.0116 1.0064 1.0078 0.9976 0.9907 1.0056 1.0084 0.9982 0.9892 0.9904 0.9907
dispcorr: -0.029371217 hartree
energy: -3928.144554425572
dipole: -22.61635 21.43016 -1.18619 103.93789 -102.27514 1.66275 -24.50759 24.25832 -0.24927
magnitude: 2.05765 au
magnitude: 5.23013 debye
