program: Orca
programVersion: 5.0.2
elementType: Br F F O O O C C C C C C C C C C C C C C C C C C C C C C C C H H H H H H H H H H H H H H H H H H H H H H H
charge: 0
multiplicity: 1
keywords: wb97x-d3
keywords: def2-TZVPP
keywords: def2/J RIJCOSX
keywords: DEFGRID2
keywords: scfconv7
keywords: smallprint printgap noloewdin
keywords: NOSOSCF
formula: C24H23BrF2O3
InChI: InChI=1/C24H23BrF2O3/c1-23(2,19-11-13-21(14-12-19)30-24(25,26)27)17-28-16-18-7-6-10-22(15-18)29-20-8-4-3-5-9-20/h3-15H,16-17H2,1-2H3
53 atoms
Br 0.992527 -2.904998 2.763253
F  1.910978 -3.601626 0.348583
F  1.610278 -5.278864 1.660959
O  -2.706605 1.152715 0.244236
O  -0.117914 -4.437509 0.726935
O  2.310851 3.289882 -2.042761
C  -3.735507 -0.467264 -1.192663
C  -3.028968 0.886958 -1.100263
C  -2.781294 -1.535321 -0.671279
C  -4.070506 -0.720591 -2.666744
C  -5.048843 -0.420884 -0.410769
C  -1.612902 -1.830409 -1.375571
C  -3.006688 -2.226144 0.515741
C  -1.820693 2.230918 0.414794
C  -0.703932 -2.774772 -0.927072
C  -2.107686 -3.173045 0.986789
C  -0.961199 -3.433475 0.262927
C  -0.413268 1.901493 -0.016376
C  0.294217 2.779197 -0.826005
C  0.182583 0.708001 0.388562
C  1.597174 2.476485 -1.206179
C  1.472468 0.406209 -0.015335
C  2.19278 1.290756 -0.807611
C  1.073768 -4.139299 1.245166
C  2.314561 4.643793 -1.857042
C  2.288722 5.228607 -0.595891
C  2.408046 5.430117 -2.998146
C  2.350493 6.610883 -0.489222
C  2.48114 6.809624 -2.874407
C  2.446915 7.407642 -1.621993
H  -2.128033 0.873364 -1.728314
H  -3.685037 1.673784 -1.500903
H  -3.191282 -0.693627 -3.311287
H  -4.546726 -1.693552 -2.795748
H  -4.764286 0.037866 -3.034756
H  -5.583221 -1.370405 -0.475908
H  -5.699686 0.34742 -0.832233
H  -4.915219 -0.185652 0.644984
H  -1.389174 -1.317646 -2.302377
H  -3.895648 -2.039986 1.101731
H  -2.172416 3.126634 -0.114248
H  -1.831798 2.468724 1.481813
H  0.176069 -2.994636 -1.516206
H  -2.307733 -3.704703 1.908271
H  -0.177739 3.694342 -1.166003
H  -0.362488 0.012824 1.014911
H  1.931647 -0.525588 0.28977
H  3.203897 1.060027 -1.118517
H  2.228004 4.621901 0.2988
H  2.429266 4.961726 -3.974347
H  2.330173 7.064908 0.493229
H  2.55716 7.418461 -3.766156
H  2.497297 8.484494 -1.529051
elementType: Br F O C H
totalener: -3928.11587852 hartree
nucrepener: 3442.18202934 hartree
electener: -7370.29790787 hartree
twoeener: 4911.01736616 hartree
cpcmener: -0.02213813 hartree
kineticenergy: 3918.79237446 hartree
xcener: -198.380682912659 hartree
chargesum: 0.0000000
charge: -0.083190 -0.158245 -0.148039 -0.364828 -0.272793 -0.330233 0.397367 -0.101276 -0.046962 -0.335575 -0.365342 -0.199491 -0.182682 0.067086 -0.192561 -0.144160 0.173141 0.004402 -0.166283 -0.229651 0.253121 -0.094179 -0.246882 0.436136 0.287407 -0.189213 -0.253845 -0.147331 -0.119650 -0.189797 0.109001 0.106394 0.100820 0.109472 0.103320 0.112413 0.103113 0.096906 0.140792 0.143349 0.094317 0.108743 0.147967 0.146255 0.141077 0.123623 0.138757 0.145438 0.153605 0.145220 0.158520 0.157139 0.157305
qa: -0.0832 -0.1582 -0.1480 -0.3648 -0.2728 -0.3302 0.3974 -0.1013 -0.0470 -0.3356 -0.3653 -0.1995 -0.1827 0.0671 -0.1926 -0.1442 0.1731 0.0044 -0.1663 -0.2297 0.2531 -0.0942 -0.2469 0.4361 0.2874 -0.1892 -0.2538 -0.1473 -0.1196 -0.1898 0.1090 0.1064 0.1008 0.1095 0.1033 0.1124 0.1031 0.0969 0.1408 0.1433 0.0943 0.1087 0.1480 0.1463 0.1411 0.1236 0.1388 0.1454 0.1536 0.1452 0.1585 0.1571 0.1573
va: 1.1728 1.1262 1.1485 1.9370 2.1040 2.0727 3.5530 3.9814 3.5996 3.9218 3.9195 3.9464 3.9719 3.8990 4.0017 4.0208 3.7555 3.6273 3.8865 3.9312 3.7313 3.8613 4.0739 4.5451 3.6976 3.8968 4.0042 3.8976 3.8857 3.9059 0.9808 1.0030 1.0035 1.0020 1.0038 0.9993 1.0057 1.0115 1.0061 0.9983 0.9997 0.9889 1.0092 1.0056 1.0074 1.0070 1.0006 1.0070 0.9987 1.0088 0.9906 0.9892 0.9908
dispcorr: -0.030180183 hartree
energy: -3928.146058707238
dipole: -40.19328 38.92769 -1.26559 65.28353 -63.90743 1.37609 -48.23087 47.53591 -0.69495
magnitude: 1.99457 au
magnitude: 5.06980 debye
