program: Gaussian 09
title: 000067524
version: EM64L-G09RevD.01
frameworkgroup: C1[X(C14H28)]
method: RPBEPBE
basis: SDD
operation: Freq
keyword: #p
keyword: freq=noraman
keyword: PBEPBE/SDD
title: #p freq=noraman PBEPBE/SDD
converged: YES YES NO NO
title: Mulliken charges:
elementType: C C C C C C C C C C C C C C H H H H H H H H H H H H H H H H H H H H H H H H H H H H
charge: -0.391271 -0.409574 -0.407164 -0.387301 -0.388165 -0.392449 -0.398710 -0.421344 -0.371137 -0.368718 -0.399498 -0.386537 -0.389958 -0.382055 0.188999 0.197607 0.203449 0.217509 0.195568 0.193219 0.190287 0.200054 0.204968 0.193655 0.194027 0.204885 0.199135 0.201516 0.198116 0.189970 0.189051 0.187835 0.204801 0.186756 0.193526 0.199368 0.190802 0.197503 0.195071 0.199131 0.187622 0.189449
chargesum: 0.00000
title: Mulliken charges with hydrogens summed into heavy atoms:
elementType: C C C C C C C C C C C C C C
charge: -0.004665 0.011385 -0.018377 0.003039 0.010459 0.006464 0.001942 -0.033257 0.005748 0.022839 -0.006604 0.001768 0.004243 -0.004983
polarizability: 1.62531203e+02 1.02929993e-01 1.57212134e+02 -7.11162047e-02 -3.44735466e-02 1.22549747e+02
1716.lowfreq: -16.2167 -8.4896 -0.0002 0.0005 0.0006 14.3257 46.9510 65.5611 72.2451
frequency: 46.6348 65.2985 71.9953 106.4146 125.4292 145.4016 172.1747 179.9244 197.5714 216.6299 228.2599 248.8896 262.6145 297.4040 305.9053 339.5339 362.6089 409.6720 434.0136 469.3452 497.4079 517.6315 697.8187 709.7090 721.9040 753.1429 764.7707 782.5025 793.4980 806.2616 822.5411 877.3154 877.6121 897.7048 905.2854 922.3451 969.3934 979.2497 998.6725 1004.6952 1010.1126 1047.5279 1058.6813 1070.2019 1078.0141 1087.0146 1095.0019 1104.7684 1115.2508 1121.7045 1145.7504 1155.4808 1156.0991 1170.4384 1191.8647 1216.8529 1235.0697 1256.6281 1263.0712 1270.7833 1281.5998 1283.9478 1290.7919 1293.1735 1297.2679 1298.8183 1306.3191 1317.9814 1327.7112 1334.0973 1338.7817 1342.0594 1345.1883 1350.6958 1352.9600 1355.9262 1358.3126 1361.5802 1458.0868 1459.0600 1461.1415 1465.5245 1466.1547 1467.4545 1469.0372 1471.6477 1474.2700 1475.9063 1478.7032 1479.4949 1484.3902 1489.7379 2950.9036 2953.5973 2954.6337 2956.3780 2956.9051 2959.2980 2961.5563 2963.5901 2966.2688 2968.0707 2971.1586 2972.5119 2973.6228 2974.4650 2998.4938 3000.0795 3000.4733 3002.2405 3005.0248 3011.2556 3013.4867 3019.2303 3021.8093 3026.8676 3029.9340 3035.1148 3037.7629 3045.8839
redmass: 2.9787 2.6300 3.1220 2.7698 2.2372 2.2887 1.8824 2.1746 2.4814 2.4200 2.5208 2.3700 2.2541 2.0183 1.8479 2.0792 2.5132 2.1359 2.3339 2.2225 2.1178 2.3533 1.2010 1.2275 1.2233 1.3183 1.4827 1.7284 1.7460 1.6748 2.0886 2.3896 1.7177 1.7463 2.2693 2.0561 1.6057 1.7647 1.9805 1.8110 2.0264 1.8231 1.6959 1.7017 2.2524 1.7071 1.6239 2.0551 2.2892 2.0804 1.7020 1.5350 1.5101 1.3584 1.3024 1.3810 1.3669 1.2975 1.2423 1.2521 1.2672 1.2295 1.1916 1.1861 1.1009 1.1554 1.1736 1.1846 1.3382 1.4037 1.4188 1.4631 1.4672 1.4890 1.4255 1.4413 1.5104 1.4596 1.0708 1.0704 1.0852 1.0803 1.0825 1.0866 1.0785 1.0870 1.0875 1.0825 1.0830 1.0926 1.0875 1.0942 1.0598 1.0602 1.0592 1.0616 1.0601 1.0611 1.0613 1.0618 1.0631 1.0635 1.0618 1.0637 1.0619 1.0621 1.0954 1.0985 1.0976 1.0959 1.0994 1.0982 1.0994 1.0981 1.1001 1.1012 1.1029 1.1023 1.1022 1.1007
irintensity: 0.0010 0.0049 0.0057 0.0035 0.0360 0.0019 0.0579 0.0275 0.0277 0.0127 0.0998 0.0619 0.1441 0.3479 0.5401 0.0276 0.1455 0.1220 0.1327 0.7337 0.9689 1.9302 2.0291 10.6453 15.4071 9.1361 7.3421 2.4385 2.7943 0.4218 0.5396 0.4051 2.3182 2.3943 1.2505 0.6035 3.2916 0.6187 0.3915 2.3832 0.1383 0.8542 0.1268 0.9194 3.3556 1.4237 0.3795 0.0390 0.9952 0.0589 0.1716 0.0956 0.4456 0.5334 0.4820 2.5083 5.6192 1.3318 4.7332 3.8964 2.1636 1.9533 0.4956 0.7360 1.2517 0.1758 0.1845 0.0546 0.1294 2.7056 0.9581 1.3758 0.2405 0.5491 1.1614 1.1609 0.9618 0.5052 0.6513 0.3412 8.4854 5.2025 15.2174 8.4106 4.1535 2.7974 1.4801 6.2465 3.4093 3.4994 41.1072 7.1563 32.4774 32.1344 21.2249 9.5500 16.6694 3.1854 9.2021 22.1933 67.0234 159.2827 16.7315 14.0581 40.8140 1.2473 10.6643 0.9607 11.1130 28.0885 6.5390 3.9260 10.2156 96.4452 25.0676 88.8959 104.9734 261.3831 195.9789 57.8359
temp: 298.150 k
press: 1.00000 atm
elementType: 6 6 6 6 6 6 6 6 6 6 6 6 6 6 1 1 1 1 1 1 1 1 1 1 1 1 1 1 1 1 1 1 1 1 1 1 1 1 1 1 1 1
symmnumber: 1
zpe: 1028812.0 jmol-1
zpe.correction: 0.391854 hartree
zpe.thermalcorrener: 0.407726 hartree
zpe.thermalcorrenthalpy: 0.408670 hartree
zpe.thermalcorrgfe: 0.349431 hartree
zpe.sumelectzpe: -549.106644 hartree
zpe.sumelectthermal: -549.090772 hartree
zpe.sumelectthermalent: -549.089828 hartree
zpe.sumelectthermalfe: -549.149066 hartree
dipole: -0.0085 0.0254 -0.0064
dipole: 0.0275
quadrupole: -91.6972 -91.4972 -91.9387
quadrupole: -0.0699 -0.0231 0.2785
quadrupole: 0.0138 0.2138 -0.2277 -0.0699 -0.0231 0.2785
hfenergy: -549.4984976 hartree
pointgroup: C01 [X(C14H28)]
dipole: -0.0034574 -0.0099448 0.0025066 debye
polarizability: 162.5278966|-0.1653494|157.2152726|0.1079156|0.0356009|122.5499154 unknown
InChI: InChI=1S/C14H28/c1-2-4-6-8-10-12-14-13-11-9-7-5-3-1/h1-14H2
charge 0 multiplicity 1
42 atoms
C  0.934729 2.519733 -0.510926
C  -0.20494 1.953608 0.365462
C  2.350839 2.33663 0.098129
C  -1.62023 2.292829 -0.160927
C  2.691715 0.890125 0.540817
C  -2.757649 1.508405 0.559511
C  2.652309 -0.162752 -0.594065
C  -3.34749 0.334834 -0.269345
C  2.749091 -1.620687 -0.069296
C  -2.356866 -0.794183 -0.654346
C  1.429229 -2.149017 0.555228
C  -1.859931 -1.651363 0.535372
C  0.370439 -2.561636 -0.497538
C  -1.023223 -2.885754 0.103673
H  0.760395 3.602124 -0.683482
H  0.88787 2.041929 -1.510843
H  -0.102141 2.336248 1.402999
H  -0.102629 0.853536 0.432483
H  2.44675 3.003646 0.979906
H  3.105914 2.681913 -0.638225
H  -1.663715 2.083325 -1.25048
H  -1.782981 3.384468 -0.057138
H  1.997054 0.586692 1.348828
H  3.704108 0.883454 0.994869
H  -3.590422 2.196543 0.80589
H  -2.381003 1.128443 1.530791
H  3.483542 0.039461 -1.299816
H  1.718884 -0.050395 -1.180257
H  -3.780487 0.756688 -1.200266
H  -4.194112 -0.112888 0.292583
H  3.56364 -1.672685 0.682308
H  3.044863 -2.298383 -0.896671
H  -1.494205 -0.357232 -1.195614
H  -2.860471 -1.468468 -1.378618
H  1.008815 -1.377637 1.231514
H  1.647586 -3.02807 1.195569
H  -2.744556 -2.003037 1.106061
H  -1.27253 -1.026974 1.237606
H  0.74901 -3.454112 -1.036974
H  0.269561 -1.766599 -1.263042
H  -1.614264 -3.46281 -0.637644
H  -0.881998 -3.555051 0.97781
