program: Orca
programVersion: 5.0.2
elementType: Br F F O O O C C C C C C C C C C C C C C C C C C C C C C C C H H H H H H H H H H H H H H H H H H H H H H H
charge: 0
multiplicity: 1
keywords: wb97x-d3
keywords: def2-TZVPP
keywords: def2/J RIJCOSX
keywords: DEFGRID2
keywords: scfconv7
keywords: smallprint printgap noloewdin
keywords: NOSOSCF
formula: C24H23BrF2O3
InChI: InChI=1/C24H23BrF2O3/c1-23(2,19-11-13-21(14-12-19)30-24(25,26)27)17-28-16-18-7-6-10-22(15-18)29-20-8-4-3-5-9-20/h3-15H,16-17H2,1-2H3
53 atoms
Br 1.269044 -3.492889 -1.451365
F  2.382429 -4.61482 0.722096
F  2.173011 -2.476194 0.850218
O  -3.240156 0.457875 -1.250624
O  0.445369 -3.838851 1.183865
O  0.670647 4.340682 0.372387
C  -4.121953 -0.444073 0.792558
C  -3.695564 0.815286 0.033135
C  -2.915981 -1.369645 0.900867
C  -5.304709 -1.099621 0.080223
C  -4.585333 -0.016573 2.189639
C  -2.883671 -2.632157 0.315887
C  -1.776903 -0.950298 1.59078
C  -2.518147 1.475838 -1.905172
C  -1.759618 -3.442272 0.399755
C  -0.64505 -1.742652 1.688722
C  -0.646346 -2.983244 1.074744
C  -1.159563 1.689851 -1.28774
C  -0.799661 2.93145 -0.782848
C  -0.267774 0.625208 -1.180892
C  0.429857 3.105793 -0.159048
C  0.95385 0.807228 -0.553741
C  1.311294 2.041814 -0.028255
C  1.555089 -3.606407 0.48211
C  1.934646 4.858755 0.415797
C  2.83292 4.728906 -0.637087
C  2.26997 5.59401 1.5446
C  4.07761 5.334796 -0.542938
C  3.512894 6.205918 1.618357
C  4.424658 6.074103 0.580213
H  -4.547706 1.506873 -0.039652
H  -2.913812 1.336785 0.600154
H  -5.655507 -1.981455 0.61931
H  -6.138679 -0.396935 0.032968
H  -5.076879 -1.402362 -0.941917
H  -5.44472 0.653313 2.119195
H  -3.808628 0.507906 2.747509
H  -4.889353 -0.882692 2.779209
H  -3.739613 -3.012326 -0.223768
H  -1.752522 0.022982 2.064372
H  -2.413052 1.154148 -2.944137
H  -3.078358 2.419864 -1.915714
H  -1.759815 -4.423948 -0.056196
H  0.211106 -1.390726 2.248314
H  -1.484514 3.768891 -0.85556
H  -0.532271 -0.347779 -1.576677
H  1.640192 -0.023221 -0.452485
H  2.261535 2.159348 0.476637
H  2.571018 4.168498 -1.525816
H  1.558242 5.690255 2.355148
H  4.777269 5.231908 -1.362464
H  3.769607 6.781755 2.49827
H  5.396192 6.54613 0.643513
elementType: Br F O C H
totalener: -3928.11525366 hartree
nucrepener: 3466.68449425 hartree
electener: -7394.79974791 hartree
twoeener: 4935.68953625 hartree
cpcmener: -0.02221656 hartree
kineticenergy: 3918.79783805 hartree
xcener: -198.381849393639 hartree
chargesum: 0.0000000
charge: -0.083526 -0.147769 -0.157278 -0.366754 -0.273859 -0.328096 0.404461 -0.097110 -0.074019 -0.372075 -0.334679 -0.168477 -0.189369 0.069025 -0.144821 -0.200387 0.178485 0.028687 -0.246589 -0.237934 0.292500 -0.123410 -0.205328 0.434955 0.299284 -0.201844 -0.256369 -0.143150 -0.119161 -0.187469 0.106852 0.106853 0.109858 0.102874 0.098976 0.104010 0.101001 0.109109 0.144399 0.139261 0.111374 0.093910 0.147180 0.148087 0.128919 0.124908 0.144088 0.155667 0.155572 0.144873 0.159213 0.157628 0.157465
qa: -0.0835 -0.1478 -0.1573 -0.3668 -0.2739 -0.3281 0.4045 -0.0971 -0.0740 -0.3721 -0.3347 -0.1685 -0.1894 0.0690 -0.1448 -0.2004 0.1785 0.0287 -0.2466 -0.2379 0.2925 -0.1234 -0.2053 0.4350 0.2993 -0.2018 -0.2564 -0.1431 -0.1192 -0.1875 0.1069 0.1069 0.1099 0.1029 0.0990 0.1040 0.1010 0.1091 0.1444 0.1393 0.1114 0.0939 0.1472 0.1481 0.1289 0.1249 0.1441 0.1557 0.1556 0.1449 0.1592 0.1576 0.1575
va: 1.1721 1.1488 1.1265 1.9322 2.1052 2.0757 3.5358 3.9803 3.6357 3.9247 3.9251 3.9560 3.9401 3.8873 4.0191 3.9959 3.7509 3.6222 3.9956 3.9276 3.7205 3.8544 3.9686 4.5456 3.6804 3.9137 4.0115 3.8892 3.8837 3.9074 1.0034 0.9812 0.9991 1.0059 1.0108 1.0034 1.0029 1.0024 0.9982 1.0057 0.9897 0.9984 1.0053 1.0094 1.0204 1.0135 1.0032 0.9969 0.9979 1.0090 0.9902 0.9892 0.9908
dispcorr: -0.030549307 hartree
energy: -3928.145802967820
dipole: -45.28056 44.43993 -0.84063 66.10886 -65.04351 1.06535 18.73634 -18.50269 0.23365
magnitude: 1.37703 au
magnitude: 3.50014 debye
