program: Orca
programVersion: 5.0.2
elementType: Br F F O O O C C C C C C C C C C C C C C C C C C C C C C C C H H H H H H H H H H H H H H H H H H H H H H H
charge: 0
multiplicity: 1
keywords: wb97x-d3
keywords: def2-TZVPP
keywords: def2/J RIJCOSX
keywords: DEFGRID2
keywords: scfconv7
keywords: smallprint printgap noloewdin
keywords: NOSOSCF
formula: C24H23BrF2O3
InChI: InChI=1/C24H23BrF2O3/c1-23(2,19-11-13-21(14-12-19)30-24(25,26)27)17-28-16-18-7-6-10-22(15-18)29-20-8-4-3-5-9-20/h3-15H,16-17H2,1-2H3
53 atoms
Br 3.869562 -1.882775 -0.125161
F  1.741722 -0.992737 -1.505898
F  1.94058 -3.131011 -1.478719
O  -4.286477 0.438249 -0.869676
O  1.254619 -2.088371 0.363941
O  0.447133 1.443639 0.391881
C  -4.433592 -1.563668 0.45616
C  -4.721284 -0.060799 0.374072
C  -2.923018 -1.758767 0.394798
C  -5.164955 -2.29503 -0.670994
C  -4.996826 -2.071604 1.787581
C  -2.12097 -1.431178 1.489822
C  -2.273148 -2.195647 -0.753626
C  -4.202678 1.838283 -0.92831
C  -0.742432 -1.533607 1.440366
C  -0.889388 -2.315967 -0.826121
C  -0.130945 -1.9791 0.280221
C  -2.995253 2.393553 -0.212942
C  -1.790207 1.700002 -0.236352
C  -3.062182 3.620329 0.438332
C  -0.674813 2.221411 0.401811
C  -1.936604 4.139135 1.062923
C  -0.736314 3.444459 1.060301
C  2.035996 -2.030258 -0.717032
C  1.688977 2.016194 0.381666
C  2.020652 3.030821 -0.50862
C  2.634277 1.50336 1.256769
C  3.31283 3.534519 -0.509325
C  3.926425 2.009391 1.237627
C  4.270033 3.028959 0.361406
H  -5.800209 0.114526 0.497084
H  -4.217855 0.450964 1.205283
H  -4.974896 -3.369197 -0.631879
H  -6.241823 -2.150157 -0.565997
H  -4.891282 -1.945925 -1.665877
H  -4.761043 -3.126792 1.933304
H  -6.083608 -1.971257 1.802466
H  -4.612954 -1.522994 2.648346
H  -2.565568 -1.072318 2.408785
H  -2.837047 -2.462374 -1.636531
H  -4.145509 2.098539 -1.989177
H  -5.112937 2.312913 -0.538233
H  -0.143127 -1.266838 2.30162
H  -0.457194 -2.67881 -1.747422
H  -1.708404 0.746151 -0.743998
H  -3.996183 4.168835 0.464182
H  -1.994815 5.091347 1.574588
H  0.127423 3.850093 1.571678
H  1.284173 3.42187 -1.19982
H  2.360883 0.710102 1.941115
H  3.572629 4.32459 -1.202172
H  4.665214 1.604611 1.917264
H  5.276992 3.425117 0.352201
elementType: Br F O C H
totalener: -3928.11314644 hartree
nucrepener: 3603.08099055 hartree
electener: -7531.19413699 hartree
twoeener: 5073.29467262 hartree
cpcmener: -0.02255896 hartree
kineticenergy: 3918.78915741 hartree
xcener: -198.381944780469 hartree
chargesum: 0.0000000
charge: -0.041775 -0.161062 -0.161399 -0.367841 -0.272467 -0.312590 0.396649 -0.106654 -0.026389 -0.360540 -0.337725 -0.193913 -0.258565 0.064664 -0.232122 -0.129196 0.237778 0.044508 -0.318059 -0.213491 0.306910 -0.128906 -0.226686 0.436543 0.294108 -0.199163 -0.274562 -0.143038 -0.106232 -0.177419 0.106111 0.111834 0.115661 0.102210 0.094644 0.110645 0.102271 0.101083 0.140044 0.140091 0.104973 0.096889 0.147688 0.134677 0.141444 0.138937 0.157321 0.153375 0.156960 0.143159 0.157926 0.153633 0.157058
qa: -0.0418 -0.1611 -0.1614 -0.3678 -0.2725 -0.3126 0.3966 -0.1067 -0.0264 -0.3605 -0.3377 -0.1939 -0.2586 0.0647 -0.2321 -0.1292 0.2378 0.0445 -0.3181 -0.2135 0.3069 -0.1289 -0.2267 0.4365 0.2941 -0.1992 -0.2746 -0.1430 -0.1062 -0.1774 0.1061 0.1118 0.1157 0.1022 0.0946 0.1106 0.1023 0.1011 0.1400 0.1401 0.1050 0.0969 0.1477 0.1347 0.1414 0.1389 0.1573 0.1534 0.1570 0.1432 0.1579 0.1536 0.1571
va: 1.1854 1.1326 1.1307 1.9408 2.1373 2.0471 3.5571 3.9784 3.5955 3.9147 3.9138 3.9681 4.0857 3.8996 3.9742 3.9799 3.7364 3.5686 4.0360 3.9527 3.7161 3.9045 3.9400 4.5363 3.6045 3.9473 3.9807 3.8961 3.8537 3.9029 1.0028 0.9816 0.9992 1.0048 1.0128 1.0014 1.0046 1.0032 1.0041 1.0029 0.9892 0.9971 1.0032 1.0265 1.0138 1.0028 0.9906 0.9995 0.9978 1.0107 0.9901 0.9919 0.9899
dispcorr: -0.032866796 hartree
energy: -3928.146013233443
dipole: -83.78073 82.46466 -1.31607 32.22514 -31.21269 1.01245 11.53480 -10.80475 0.73005
magnitude: 1.81385 au
magnitude: 4.61045 debye
