program: Orca
programVersion: 5.0.2
elementType: Br F F O O O C C C C C C C C C C C C C C C C C C C C C C C C H H H H H H H H H H H H H H H H H H H H H H H
charge: 0
multiplicity: 1
keywords: wb97x-d3
keywords: def2-TZVPP
keywords: def2/J RIJCOSX
keywords: DEFGRID2
keywords: scfconv7
keywords: smallprint printgap noloewdin
keywords: NOSOSCF
formula: C24H23BrF2O3
InChI: InChI=1/C24H23BrF2O3/c1-23(2,19-11-13-21(14-12-19)30-24(25,26)27)17-28-16-18-7-6-10-22(15-18)29-20-8-4-3-5-9-20/h3-15H,16-17H2,1-2H3
53 atoms
Br 3.224635 -2.879951 2.144251
F  1.563082 -0.882863 1.466239
F  3.077855 -1.295626 -0.002496
O  -3.583342 0.87645 -0.388401
O  1.380791 -2.704891 0.203082
O  0.735567 3.065531 0.824268
C  -3.647585 -0.982488 -1.883421
C  -4.356351 -0.23999 -0.745763
C  -2.280009 -1.425074 -1.372473
C  -3.552449 -0.07186 -3.107862
C  -4.5001 -2.198931 -2.259131
C  -2.19758 -2.375221 -0.352471
C  -1.085331 -0.893374 -1.849923
C  -3.906659 1.451652 0.849099
C  -0.981743 -2.770538 0.176814
C  0.148277 -1.284137 -1.340326
C  0.182969 -2.219808 -0.324482
C  -2.866091 2.482211 1.1887
C  -1.535982 2.272584 0.838817
C  -3.219126 3.641658 1.8717
C  -0.585369 3.237788 1.138997
C  -2.252646 4.581145 2.198918
C  -0.931163 4.394599 1.821872
C  2.208184 -1.870103 0.840675
C  1.112808 2.651302 -0.420727
C  0.354995 2.877411 -1.564673
C  2.351525 2.027275 -0.510191
C  0.844497 2.461763 -2.795527
C  2.833253 1.632618 -1.749025
C  2.080694 1.838959 -2.897674
H  -5.362203 0.064214 -1.070385
H  -4.489478 -0.911616 0.114037
H  -3.083078 -0.585441 -3.948922
H  -4.5547 0.221816 -3.425491
H  -2.991388 0.8438 -2.921874
H  -4.67875 -2.865251 -1.414373
H  -4.019589 -2.782138 -3.046069
H  -5.47559 -1.880835 -2.63243
H  -3.096702 -2.817615 0.057158
H  -1.087784 -0.156179 -2.640843
H  -4.901222 1.917552 0.83193
H  -3.936124 0.682921 1.635447
H  -0.938944 -3.506509 0.969569
H  1.053731 -0.859791 -1.755009
H  -1.240151 1.364953 0.326663
H  -4.253543 3.81416 2.143403
H  -2.533068 5.480682 2.731569
H  -0.177196 5.136602 2.052535
H  -0.60459 3.375082 -1.512606
H  2.938426 1.868557 0.385765
H  0.250472 2.638918 -3.683093
H  3.803261 1.156865 -1.813957
H  2.456296 1.524385 -3.862332
elementType: Br F O C H
totalener: -3928.11290219 hartree
nucrepener: 3566.11712284 hartree
electener: -7494.23002503 hartree
twoeener: 5035.83716810 hartree
cpcmener: -0.02277345 hartree
kineticenergy: 3918.79244771 hartree
xcener: -198.377903049961 hartree
chargesum: 0.0000000
charge: -0.048434 -0.162030 -0.161224 -0.357525 -0.288790 -0.326770 0.385867 -0.082644 -0.054925 -0.362501 -0.331669 -0.193327 -0.221086 0.080448 -0.188507 -0.156589 0.196751 0.012003 -0.192471 -0.222834 0.262853 -0.118863 -0.246632 0.438084 0.340164 -0.205590 -0.272341 -0.174059 -0.127509 -0.173330 0.106371 0.101859 0.111913 0.103543 0.091476 0.100244 0.109055 0.102465 0.140182 0.150585 0.090321 0.094110 0.146126 0.168572 0.138082 0.138022 0.156389 0.144217 0.151640 0.141002 0.158542 0.154299 0.154463
qa: -0.0484 -0.1620 -0.1612 -0.3575 -0.2888 -0.3268 0.3859 -0.0826 -0.0549 -0.3625 -0.3317 -0.1933 -0.2211 0.0804 -0.1885 -0.1566 0.1968 0.0120 -0.1925 -0.2228 0.2629 -0.1189 -0.2466 0.4381 0.3402 -0.2056 -0.2723 -0.1741 -0.1275 -0.1733 0.1064 0.1019 0.1119 0.1035 0.0915 0.1002 0.1091 0.1025 0.1402 0.1506 0.0903 0.0941 0.1461 0.1686 0.1381 0.1380 0.1564 0.1442 0.1516 0.1410 0.1585 0.1543 0.1545
va: 1.1853 1.1336 1.1307 1.9471 2.1174 2.0809 3.5738 3.9575 3.6669 3.9261 3.9199 3.9991 3.9382 3.8951 4.0706 3.9620 3.7832 3.7052 3.9202 3.9597 3.7305 3.8935 4.0120 4.5300 3.6287 3.8539 3.9415 3.8650 3.8517 3.8632 1.0003 0.9933 0.9996 1.0062 1.0121 1.0030 1.0020 1.0038 1.0025 0.9958 0.9921 0.9899 1.0046 1.0016 1.0110 1.0057 0.9894 1.0069 1.0006 1.0155 0.9909 0.9925 0.9911
dispcorr: -0.032030125 hartree
energy: -3928.144932316091
dipole: -77.52338 75.25408 -2.26930 41.80794 -42.04576 -0.23781 -43.21516 42.71614 -0.49901
magnitude: 2.33565 au
magnitude: 5.93676 debye
