program: Orca
programVersion: 5.0.2
elementType: Br F F O O O C C C C C C C C C C C C C C C C C C C C C C C C H H H H H H H H H H H H H H H H H H H H H H H
charge: 0
multiplicity: 1
keywords: wb97x-d3
keywords: def2-TZVPP
keywords: def2/J RIJCOSX
keywords: DEFGRID2
keywords: scfconv7
keywords: smallprint printgap noloewdin
keywords: NOSOSCF
formula: C24H23BrF2O3
InChI: InChI=1/C24H23BrF2O3/c1-23(2,19-11-13-21(14-12-19)30-24(25,26)27)17-28-16-18-7-6-10-22(15-18)29-20-8-4-3-5-9-20/h3-15H,16-17H2,1-2H3
53 atoms
Br 2.244095 -3.407509 -0.739526
F  3.675974 -1.510823 0.522206
F  2.795958 -0.844397 -1.316782
O  -4.070696 0.847166 -0.003474
O  1.589033 -1.037509 0.543813
O  0.571854 2.003703 1.577151
C  -4.012068 -1.508991 -0.412902
C  -4.631782 -0.372757 0.410658
C  -2.499866 -1.442575 -0.223681
C  -4.425116 -1.368151 -1.879331
C  -4.578829 -2.832042 0.11094
C  -1.924103 -1.821929 0.990355
C  -1.649024 -0.928239 -1.198422
C  -4.223479 1.940378 0.8698
C  -0.563364 -1.703979 1.218315
C  -0.283071 -0.787199 -0.987029
C  0.24841 -1.186222 0.224933
C  -2.931866 2.71136 0.928017
C  -1.742467 2.029435 1.176829
C  -2.899949 4.087123 0.745971
C  -0.548354 2.722836 1.258414
C  -1.694757 4.775397 0.832885
C  -0.511848 4.103623 1.09117
C  2.564168 -1.552858 -0.203526
C  1.729715 2.168231 0.873681
C  2.909212 1.903622 1.558281
C  1.756802 2.514185 -0.472009
C  4.121218 1.982472 0.890838
C  2.980434 2.602284 -1.122886
C  4.16532 2.338824 -0.450676
H  -5.723616 -0.377276 0.278227
H  -4.437614 -0.545876 1.478308
H  -3.976933 -2.150552 -2.494826
H  -5.508822 -1.466653 -1.965428
H  -4.155168 -0.406505 -2.314587
H  -5.658594 -2.870341 -0.046017
H  -4.405691 -2.976332 1.177614
H  -4.139805 -3.680671 -0.415928
H  -2.537456 -2.213859 1.791299
H  -2.040188 -0.607775 -2.153698
H  -5.040641 2.592862 0.538844
H  -4.483714 1.600512 1.880543
H  -0.13781 -2.006219 2.166755
H  0.330392 -0.354953 -1.76562
H  -1.740744 0.95587 1.323909
H  -3.815383 4.626808 0.535693
H  -1.675959 5.848983 0.696723
H  0.421412 4.647959 1.1637
H  2.87246 1.626173 2.604414
H  0.842045 2.707822 -1.017836
H  5.036701 1.768302 1.427429
H  3.00051 2.872452 -2.170935
H  5.113458 2.406343 -0.967574
elementType: Br F O C H
totalener: -3928.11296959 hartree
nucrepener: 3640.02901766 hartree
electener: -7568.14198724 hartree
twoeener: 5110.42770724 hartree
cpcmener: -0.02459773 hartree
kineticenergy: 3918.78740095 hartree
xcener: -198.381581799660 hartree
chargesum: 0.0000000
charge: -0.072033 -0.154612 -0.163643 -0.364341 -0.268798 -0.326622 0.376066 -0.093231 -0.033617 -0.357432 -0.334271 -0.171894 -0.216218 0.058400 -0.155743 -0.109709 0.110304 -0.024978 -0.209639 -0.167144 0.219462 -0.145565 -0.178406 0.443581 0.326277 -0.276577 -0.196715 -0.123997 -0.163111 -0.175967 0.104248 0.104291 0.115396 0.102183 0.094199 0.103600 0.100738 0.109039 0.138763 0.140077 0.090436 0.095083 0.146502 0.146782 0.149327 0.140124 0.156957 0.153778 0.140110 0.152002 0.154771 0.156253 0.155512
qa: -0.0720 -0.1546 -0.1636 -0.3643 -0.2688 -0.3266 0.3761 -0.0932 -0.0336 -0.3574 -0.3343 -0.1719 -0.2162 0.0584 -0.1557 -0.1097 0.1103 -0.0250 -0.2096 -0.1671 0.2195 -0.1456 -0.1784 0.4436 0.3263 -0.2766 -0.1967 -0.1240 -0.1631 -0.1760 0.1042 0.1043 0.1154 0.1022 0.0942 0.1036 0.1007 0.1090 0.1388 0.1401 0.0904 0.0951 0.1465 0.1468 0.1493 0.1401 0.1570 0.1538 0.1401 0.1520 0.1548 0.1563 0.1555
va: 1.1869 1.1403 1.1306 1.9374 2.0671 2.0352 3.5740 3.9828 3.5876 3.9126 3.9164 3.9728 4.0161 3.9032 4.0317 3.9681 3.6915 3.7600 3.9230 3.9192 3.8058 3.9147 3.9167 4.5425 3.5261 3.9971 3.8620 3.8524 3.9070 3.8861 0.9980 0.9878 0.9993 1.0054 1.0130 1.0038 1.0035 1.0016 1.0047 1.0001 0.9979 0.9917 1.0059 1.0118 0.9984 1.0046 0.9910 0.9974 1.0119 1.0025 0.9890 0.9911 0.9904
dispcorr: -0.033887633 hartree
energy: -3928.146857220387
dipole: -66.25652 64.27366 -1.98286 45.78790 -45.56971 0.21819 8.47959 -8.30912 0.17047
magnitude: 2.00210 au
magnitude: 5.08893 debye
