program: Orca
programVersion: 5.0.2
elementType: Br F F O O O C C C C C C C C C C C C C C C C C C C C C C C C H H H H H H H H H H H H H H H H H H H H H H H
charge: 0
multiplicity: 1
keywords: wb97x-d3
keywords: def2-TZVPP
keywords: def2/J RIJCOSX
keywords: DEFGRID2
keywords: scfconv7
keywords: smallprint printgap noloewdin
keywords: NOSOSCF
formula: C24H23BrF2O3
InChI: InChI=1/C24H23BrF2O3/c1-23(2,19-11-13-21(14-12-19)30-24(25,26)27)17-28-16-18-7-6-10-22(15-18)29-20-8-4-3-5-9-20/h3-15H,16-17H2,1-2H3
53 atoms
Br 2.625279 -4.017574 0.46159
F  3.713705 -3.057821 -1.803861
F  1.811967 -4.007571 -2.092111
O  -3.36869 0.810741 -0.278587
O  1.965252 -1.946367 -1.266834
O  0.515444 4.014474 -0.747208
C  -2.754913 -0.530296 1.609402
C  -3.189068 0.854129 1.118428
C  -1.507079 -0.952839 0.840673
C  -3.910043 -1.516472 1.432277
C  -2.450644 -0.418588 3.106762
C  -0.293828 -0.292999 1.046792
C  -1.528061 -1.968744 -0.110469
C  -3.948097 1.956912 -0.836957
C  0.852455 -0.647634 0.355385
C  -0.393944 -2.332605 -0.82565
C  0.793106 -1.671227 -0.573974
C  -3.037022 3.159546 -0.872569
C  -1.658159 3.018041 -0.797127
C  -3.583563 4.432748 -1.017773
C  -0.847984 4.144882 -0.833297
C  -2.761319 5.545461 -1.09402
C  -1.382917 5.412093 -0.987648
C  2.492671 -3.170904 -1.296099
C  1.056111 3.491511 0.391654
C  0.410364 3.525796 1.622919
C  2.329127 2.944358 0.280049
C  1.046633 2.996098 2.737749
C  2.953217 2.426733 1.404442
C  2.314939 2.4421 2.638177
H  -4.125722 1.139824 1.618588
H  -2.436236 1.60212 1.400565
H  -4.256682 -1.591144 0.402029
H  -3.635263 -2.518465 1.765225
H  -4.76068 -1.195488 2.035166
H  -2.123228 -1.377545 3.510205
H  -3.345199 -0.118001 3.655251
H  -1.675415 0.31653 3.32543
H  -0.221899 0.515792 1.7627
H  -2.442291 -2.504935 -0.321925
H  -4.228602 1.690096 -1.860111
H  -4.87855 2.223516 -0.317265
H  1.785755 -0.131155 0.539791
H  -0.467219 -3.112952 -1.570384
H  -1.206742 2.037334 -0.698044
H  -4.659255 4.552951 -1.073667
H  -3.194692 6.529896 -1.214993
H  -0.734478 6.278442 -1.018938
H  -0.574003 3.96366 1.726878
H  2.824213 2.926294 -0.682968
H  0.539938 3.024373 3.694108
H  3.943977 2.000528 1.310976
H  2.802557 2.031167 3.51228
elementType: Br F O C H
totalener: -3928.11543632 hartree
nucrepener: 3506.55201414 hartree
electener: -7434.66745046 hartree
twoeener: 4975.43862387 hartree
cpcmener: -0.02243145 hartree
kineticenergy: 3918.79006991 hartree
xcener: -198.382586640538 hartree
chargesum: 0.0000000
charge: -0.076670 -0.149899 -0.159465 -0.367672 -0.262853 -0.332366 0.376093 -0.095049 -0.007047 -0.361433 -0.337293 -0.247455 -0.192969 0.044906 -0.115161 -0.106944 0.085804 0.063049 -0.236700 -0.228473 0.242245 -0.123068 -0.224804 0.424640 0.309546 -0.197680 -0.247497 -0.165818 -0.143914 -0.163857 0.115571 0.100966 0.094356 0.112925 0.102513 0.109151 0.103926 0.100369 0.126850 0.145631 0.109950 0.098882 0.160957 0.152544 0.160619 0.139948 0.157505 0.145830 0.149328 0.142824 0.155392 0.156916 0.154853
qa: -0.0767 -0.1499 -0.1595 -0.3677 -0.2629 -0.3324 0.3761 -0.0950 -0.0070 -0.3614 -0.3373 -0.2475 -0.1930 0.0449 -0.1152 -0.1069 0.0858 0.0630 -0.2367 -0.2285 0.2422 -0.1231 -0.2248 0.4246 0.3095 -0.1977 -0.2475 -0.1658 -0.1439 -0.1639 0.1156 0.1010 0.0944 0.1129 0.1025 0.1092 0.1039 0.1004 0.1268 0.1456 0.1100 0.0989 0.1610 0.1525 0.1606 0.1399 0.1575 0.1458 0.1493 0.1428 0.1554 0.1569 0.1549
va: 1.1801 1.1452 1.1294 1.9346 2.1120 2.0739 3.5793 3.9418 3.5985 3.9196 3.9302 4.0272 3.9723 3.9170 3.9575 3.9746 3.9157 3.5468 3.9672 3.9750 3.7411 3.8768 4.0078 4.5694 3.6469 3.8173 3.9495 3.8766 3.8669 3.8503 1.0040 0.9812 1.0126 0.9997 1.0060 1.0026 1.0028 0.9980 1.0095 0.9968 0.9900 0.9965 1.0069 1.0107 1.0052 1.0016 0.9891 1.0046 1.0037 1.0096 0.9941 0.9892 0.9905
dispcorr: -0.031899482 hartree
energy: -3928.147335801753
dipole: -65.05478 63.08039 -1.97439 70.12165 -69.16647 0.95519 18.14310 -16.75665 1.38644
magnitude: 2.59477 au
magnitude: 6.59537 debye
