program: Orca
programVersion: 5.0.2
elementType: Br F F O O O C C C C C C C C C C C C C C C C C C C C C C C C H H H H H H H H H H H H H H H H H H H H H H H
charge: 0
multiplicity: 1
keywords: wb97x-d3
keywords: def2-TZVPP
keywords: def2/J RIJCOSX
keywords: DEFGRID2
keywords: scfconv7
keywords: smallprint printgap noloewdin
keywords: NOSOSCF
formula: C24H23BrF2O3
InChI: InChI=1/C24H23BrF2O3/c1-23(2,19-11-13-21(14-12-19)30-24(25,26)27)17-28-16-18-7-6-10-22(15-18)29-20-8-4-3-5-9-20/h3-15H,16-17H2,1-2H3
53 atoms
Br 2.273573 -4.065735 -0.447913
F  4.007581 -2.032492 -0.1362
F  2.896099 -1.943961 -1.968653
O  -3.623866 1.001302 0.086624
O  1.990528 -1.337027 -0.029242
O  0.395695 3.462322 1.784552
C  -3.710372 -1.373992 -0.181697
C  -4.151122 -0.012206 -0.728407
C  -2.186064 -1.396737 -0.144585
C  -4.257514 -2.453516 -1.120568
C  -4.327798 -1.598111 1.200735
C  -1.469305 -1.202509 1.034273
C  -1.449597 -1.557056 -1.317793
C  -3.858159 2.303174 -0.379521
C  -0.083076 -1.198766 1.050131
C  -0.062765 -1.544148 -1.329273
C  0.610847 -1.380011 -0.131198
C  -2.980046 3.26293 0.373717
C  -1.681305 2.899609 0.714713
C  -3.447028 4.52928 0.711033
C  -0.865269 3.805794 1.376549
C  -2.620926 5.425518 1.373126
C  -1.322415 5.07251 1.707333
C  2.79515 -2.191051 -0.655354
C  1.278322 2.898609 0.908413
C  2.262688 2.08613 1.458957
C  1.256316 3.151432 -0.458021
C  3.230093 1.529627 0.637289
C  2.223508 2.573038 -1.26936
C  3.212069 1.761414 -0.731888
H  -3.799022 0.105078 -1.763975
H  -5.249912 0.033958 -0.755348
H  -5.348997 -2.449265 -1.105626
H  -3.951882 -2.311138 -2.157422
H  -3.928066 -3.445996 -0.80966
H  -4.008252 -2.550882 1.626522
H  -5.415681 -1.625885 1.116684
H  -4.082677 -0.814536 1.916735
H  -1.982504 -1.060471 1.97479
H  -1.952881 -1.688914 -2.266488
H  -3.632589 2.374867 -1.453754
H  -4.912763 2.586918 -0.262806
H  0.453528 -1.059955 1.980183
H  0.455357 -1.656209 -2.271176
H  -1.305374 1.913263 0.470306
H  -4.461991 4.814314 0.461785
H  -2.990322 6.408643 1.634691
H  -0.67305 5.765807 2.226941
H  2.270759 1.899089 2.525704
H  0.503065 3.794536 -0.894975
H  3.995125 0.899697 1.072422
H  2.201867 2.76962 -2.333697
H  3.962438 1.316357 -1.372071
elementType: Br F O C H
totalener: -3928.11483191 hartree
nucrepener: 3545.31215203 hartree
electener: -7473.42698394 hartree
twoeener: 5014.93710954 hartree
cpcmener: -0.02333428 hartree
kineticenergy: 3918.80230756 hartree
xcener: -198.382794547688 hartree
chargesum: -0.0000000
charge: -0.074495 -0.153539 -0.164408 -0.357484 -0.258455 -0.328813 0.362946 -0.079808 -0.017951 -0.333015 -0.358419 -0.224568 -0.178429 0.088523 -0.157083 -0.161088 0.155268 0.011356 -0.183918 -0.221304 0.249165 -0.120948 -0.242019 0.434142 0.303882 -0.275288 -0.186778 -0.113934 -0.153762 -0.187205 0.103644 0.101718 0.102813 0.099847 0.110398 0.116273 0.101558 0.093454 0.141798 0.145260 0.090998 0.089943 0.147110 0.154165 0.133270 0.138200 0.156216 0.144647 0.142225 0.151732 0.151031 0.157153 0.153975
qa: -0.0745 -0.1535 -0.1644 -0.3575 -0.2585 -0.3288 0.3629 -0.0798 -0.0180 -0.3330 -0.3584 -0.2246 -0.1784 0.0885 -0.1571 -0.1611 0.1553 0.0114 -0.1839 -0.2213 0.2492 -0.1209 -0.2420 0.4341 0.3039 -0.2753 -0.1868 -0.1139 -0.1538 -0.1872 0.1036 0.1017 0.1028 0.0998 0.1104 0.1163 0.1016 0.0935 0.1418 0.1453 0.0910 0.0899 0.1471 0.1542 0.1333 0.1382 0.1562 0.1446 0.1422 0.1517 0.1510 0.1572 0.1540
va: 1.1825 1.1424 1.1260 1.9553 2.1040 2.0752 3.6056 3.9653 3.6083 3.9114 3.9105 3.9573 4.0198 3.8887 3.9826 4.0254 3.7321 3.7225 3.9320 3.9596 3.7368 3.8960 4.0095 4.5561 3.6678 3.9633 3.8783 3.8287 3.8967 3.8614 0.9943 0.9958 1.0039 1.0044 1.0014 0.9992 1.0058 1.0141 0.9979 1.0011 0.9885 0.9936 1.0047 1.0125 1.0152 1.0061 0.9895 1.0063 1.0100 0.9994 0.9973 0.9908 0.9945
dispcorr: -0.031293436 hartree
energy: -3928.146125345947
dipole: -68.43312 66.31556 -2.11755 57.15206 -56.99928 0.15279 5.66890 -6.68543 -1.01653
magnitude: 2.35387 au
magnitude: 5.98306 debye
