program: Orca
programVersion: 5.0.2
elementType: Br F F O O O C C C C C C C C C C C C C C C C C C C C C C C C H H H H H H H H H H H H H H H H H H H H H H H
charge: 0
multiplicity: 1
keywords: wb97x-d3
keywords: def2-TZVPP
keywords: def2/J RIJCOSX
keywords: DEFGRID2
keywords: scfconv7
keywords: smallprint printgap noloewdin
keywords: NOSOSCF
formula: C24H23BrF2O3
InChI: InChI=1/C24H23BrF2O3/c1-23(2,19-11-13-21(14-12-19)30-24(25,26)27)17-28-16-18-7-6-10-22(15-18)29-20-8-4-3-5-9-20/h3-15H,16-17H2,1-2H3
53 atoms
Br 2.362668 -3.433987 -0.850037
F  3.020986 -1.167769 0.416073
F  3.608401 -1.185726 -1.647728
O  -4.280961 0.702852 -0.491941
O  1.55072 -0.806189 -1.217442
O  0.460123 2.422842 -0.693701
C  -3.813754 -1.386275 0.616087
C  -4.304278 0.059122 0.760252
C  -2.363119 -1.339896 0.147868
C  -4.715976 -2.151658 -0.353434
C  -3.937216 -2.047193 1.993389
C  -1.342795 -1.004026 1.038455
C  -2.007928 -1.531877 -1.185633
C  -4.377199 2.101992 -0.41506
C  -0.026087 -0.850844 0.630898
C  -0.697217 -1.385225 -1.615257
C  0.282544 -1.037162 -0.705425
C  -3.085226 2.772238 -0.014262
C  -1.866937 2.277975 -0.470411
C  -3.099496 3.91407 0.778309
C  -0.687041 2.930952 -0.149938
C  -1.912783 4.56648 1.085805
C  -0.697685 4.087274 0.622127
C  2.619759 -1.495066 -0.817729
C  1.616256 2.342969 0.026566
C  2.798963 2.397197 -0.70097
C  1.644693 2.146334 1.402466
C  4.013347 2.251789 -0.048286
C  2.869166 2.009908 2.042555
C  4.056856 2.061211 1.326513
H  -5.326128 0.059807 1.167221
H  -3.668773 0.583004 1.486864
H  -4.379587 -3.183261 -0.473021
H  -5.734473 -2.183607 0.038063
H  -4.770086 -1.703695 -1.344842
H  -3.53043 -3.059197 1.982159
H  -4.987193 -2.116954 2.283365
H  -3.42686 -1.490479 2.779961
H  -1.563668 -0.832697 2.083646
H  -2.751556 -1.796813 -1.923913
H  -4.663784 2.44579 -1.413124
H  -5.180689 2.413174 0.265585
H  0.723743 -0.566828 1.355839
H  -0.445109 -1.526921 -2.658547
H  -1.823551 1.388755 -1.088289
H  -4.039748 4.299123 1.154813
H  -1.931369 5.460522 1.695969
H  0.220276 4.609767 0.860086
H  2.763979 2.545611 -1.773175
H  0.729744 2.088732 1.977982
H  4.930622 2.292917 -0.621568
H  2.887582 1.853686 3.113654
H  5.006079 1.95068 1.834007
elementType: Br F O C H
totalener: -3928.11558556 hartree
nucrepener: 3646.02587224 hartree
electener: -7574.14145779 hartree
twoeener: 5116.05118516 hartree
cpcmener: -0.02320263 hartree
kineticenergy: 3918.78490611 hartree
xcener: -198.383057796825 hartree
chargesum: -0.0000000
charge: -0.072487 -0.161671 -0.155471 -0.367105 -0.275156 -0.322830 0.388683 -0.109971 0.012117 -0.353357 -0.338799 -0.212138 -0.231533 0.061779 -0.150337 -0.124173 0.112635 0.028111 -0.293669 -0.196025 0.290768 -0.134988 -0.220094 0.449260 0.343949 -0.286674 -0.233992 -0.106559 -0.140885 -0.194707 0.105027 0.112746 0.115451 0.102234 0.094194 0.111483 0.103314 0.100827 0.139308 0.139061 0.105060 0.097527 0.155173 0.147608 0.149298 0.139264 0.157401 0.154031 0.140372 0.157415 0.155178 0.157434 0.155912
qa: -0.0725 -0.1617 -0.1555 -0.3671 -0.2752 -0.3228 0.3887 -0.1100 0.0121 -0.3534 -0.3388 -0.2121 -0.2315 0.0618 -0.1503 -0.1242 0.1126 0.0281 -0.2937 -0.1960 0.2908 -0.1350 -0.2201 0.4493 0.3439 -0.2867 -0.2340 -0.1066 -0.1409 -0.1947 0.1050 0.1127 0.1155 0.1022 0.0942 0.1115 0.1033 0.1008 0.1393 0.1391 0.1051 0.0975 0.1552 0.1476 0.1493 0.1393 0.1574 0.1540 0.1404 0.1574 0.1552 0.1574 0.1559
va: 1.1896 1.1356 1.1406 1.9448 2.0766 2.0401 3.5689 3.9875 3.5330 3.9116 3.9164 4.0193 4.0255 3.9009 3.9845 4.0181 3.7209 3.5976 4.0046 3.9429 3.7423 3.8984 3.9324 4.5406 3.4998 4.0040 3.8720 3.8505 3.9044 3.9031 1.0024 0.9815 0.9994 1.0048 1.0132 1.0012 1.0044 1.0028 1.0062 1.0008 0.9891 0.9972 0.9992 1.0046 1.0077 1.0022 0.9907 0.9984 1.0121 0.9997 0.9890 0.9905 0.9908
dispcorr: -0.034593544 hartree
energy: -3928.150179102181
dipole: -66.72878 65.05351 -1.67527 46.96573 -46.46002 0.50570 21.97631 -20.61770 1.35861
magnitude: 2.21542 au
magnitude: 5.63116 debye
