program: Orca
programVersion: 5.0.2
elementType: Br F F O O O C C C C C C C C C C C C C C C C C C C C C C C C H H H H H H H H H H H H H H H H H H H H H H H
charge: 0
multiplicity: 1
keywords: wb97x-d3
keywords: def2-TZVPP
keywords: def2/J RIJCOSX
keywords: DEFGRID2
keywords: scfconv7
keywords: smallprint printgap noloewdin
keywords: NOSOSCF
formula: C24H23BrF2O3
InChI: InChI=1/C24H23BrF2O3/c1-23(2,19-11-13-21(14-12-19)30-24(25,26)27)17-28-16-18-7-6-10-22(15-18)29-20-8-4-3-5-9-20/h3-15H,16-17H2,1-2H3
53 atoms
Br 2.452081 -3.27376 -1.213701
F  3.842484 -1.115007 -0.440894
F  2.424735 -0.699425 -1.999725
O  -4.259164 0.692693 -0.479229
O  1.790434 -0.923868 0.115459
O  0.469091 2.413691 -0.396303
C  -3.871489 -1.454735 0.545695
C  -4.427017 -0.036162 0.714259
C  -2.359091 -1.358298 0.378241
C  -4.547927 -2.149368 -0.637754
C  -4.232602 -2.239543 1.812556
C  -1.542961 -1.102673 1.482192
C  -1.73365 -1.453184 -0.860016
C  -4.359612 2.085143 -0.321316
C  -0.171445 -0.98111 1.361161
C  -0.358414 -1.307435 -1.012648
C  0.417817 -1.086614 0.111539
C  -3.090877 2.711073 0.202167
C  -1.858078 2.260862 -0.258983
C  -3.133105 3.760815 1.111829
C  -0.688577 2.869489 0.167961
C  -1.956064 4.368627 1.529067
C  -0.725757 3.936549 1.058885
C  2.600994 -1.352628 -0.84542
C  1.627072 2.295602 0.314492
C  1.665247 2.029406 1.67785
C  2.803056 2.379025 -0.42096
C  2.894124 1.846012 2.296711
C  4.021559 2.185827 0.210324
C  4.075319 1.920119 1.57216
H  -5.493964 -0.089822 0.975842
H  -3.916118 0.453283 1.554453
H  -4.177665 -3.169564 -0.756032
H  -5.623899 -2.210597 -0.463701
H  -4.406934 -1.635116 -1.587415
H  -3.788871 -3.235963 1.796107
H  -5.314861 -2.361232 1.884413
H  -3.906453 -1.744657 2.728005
H  -1.970654 -0.999872 2.470536
H  -2.311865 -1.636674 -1.754717
H  -4.576959 2.493434 -1.312531
H  -5.205428 2.358994 0.322681
H  0.441952 -0.806996 2.235692
H  0.053716 -1.362846 -2.009838
H  -1.796162 1.443434 -0.967138
H  -4.085682 4.109217 1.492499
H  -1.994011 5.192437 2.23031
H  0.182555 4.429393 1.381291
H  0.755683 1.949979 2.258679
H  2.75856 2.586117 -1.483013
H  2.921586 1.634515 3.35803
H  4.934033 2.246727 -0.368805
H  5.027794 1.770416 2.063249
elementType: Br F O C H
totalener: -3928.11377325 hartree
nucrepener: 3650.12238627 hartree
electener: -7578.23615951 hartree
twoeener: 5120.13677981 hartree
cpcmener: -0.02311820 hartree
kineticenergy: 3918.79450318 hartree
xcener: -198.386646926226 hartree
chargesum: -0.0000000
charge: -0.080368 -0.149850 -0.164685 -0.368035 -0.256724 -0.324483 0.390895 -0.106502 -0.004072 -0.356742 -0.338707 -0.192511 -0.289946 0.069057 -0.236766 -0.101831 0.231272 0.042347 -0.313772 -0.204141 0.296894 -0.132715 -0.225306 0.444804 0.390480 -0.261947 -0.293727 -0.130242 -0.121427 -0.193216 0.104396 0.109920 0.115165 0.102966 0.093108 0.111687 0.101588 0.101664 0.141719 0.141587 0.104684 0.097483 0.147984 0.144292 0.149959 0.139329 0.157473 0.156044 0.152873 0.139997 0.157428 0.154623 0.155999
qa: -0.0804 -0.1499 -0.1647 -0.3680 -0.2567 -0.3245 0.3909 -0.1065 -0.0041 -0.3567 -0.3387 -0.1925 -0.2899 0.0691 -0.2368 -0.1018 0.2313 0.0423 -0.3138 -0.2041 0.2969 -0.1327 -0.2253 0.4448 0.3905 -0.2619 -0.2937 -0.1302 -0.1214 -0.1932 0.1044 0.1099 0.1152 0.1030 0.0931 0.1117 0.1016 0.1017 0.1417 0.1416 0.1047 0.0975 0.1480 0.1443 0.1500 0.1393 0.1575 0.1560 0.1529 0.1400 0.1574 0.1546 0.1560
va: 1.1773 1.1473 1.1245 1.9426 2.1333 2.0528 3.5564 3.9925 3.5877 3.9161 3.9143 3.9876 4.1015 3.8967 4.0169 3.9651 3.6847 3.6098 4.0231 3.9517 3.7346 3.8991 3.9341 4.5417 3.4781 3.8771 3.9791 3.9019 3.8424 3.9135 1.0013 0.9822 0.9997 1.0040 1.0137 1.0012 1.0054 1.0025 1.0023 1.0023 0.9894 0.9968 1.0018 1.0188 1.0125 1.0031 0.9906 0.9971 1.0003 1.0127 0.9900 0.9897 0.9905
dispcorr: -0.034549144 hartree
energy: -3928.148322392065
dipole: -67.82974 66.18498 -1.64477 42.99221 -42.61470 0.37751 28.42001 -27.10832 1.31169
magnitude: 2.13736 au
magnitude: 5.43274 debye
