program: Orca
programVersion: 5.0.2
elementType: Br F F O O O C C C C C C C C C C C C C C C C C C C C C C C C H H H H H H H H H H H H H H H H H H H H H H H
charge: 0
multiplicity: 1
keywords: wb97x-d3
keywords: def2-TZVPP
keywords: def2/J RIJCOSX
keywords: DEFGRID2
keywords: scfconv7
keywords: smallprint printgap noloewdin
keywords: NOSOSCF
formula: C24H23BrF2O3
InChI: InChI=1/C24H23BrF2O3/c1-23(2,19-11-13-21(14-12-19)30-24(25,26)27)17-28-16-18-7-6-10-22(15-18)29-20-8-4-3-5-9-20/h3-15H,16-17H2,1-2H3
53 atoms
Br 1.865343 -1.255399 2.144055
F  3.811171 -2.090795 0.4816
F  2.409759 -3.625405 1.013132
O  -3.821144 0.168323 0.874533
O  1.91608 -2.086502 -0.510235
O  0.470879 3.815792 -0.872858
C  -3.697509 -1.332684 -1.098389
C  -4.000479 0.062725 -0.520777
C  -2.2093 -1.626552 -0.973851
C  -4.09925 -1.304332 -2.577905
C  -4.562086 -2.37144 -0.386818
C  -1.709204 -2.656423 -0.184429
C  -1.281139 -0.812404 -1.627717
C  -2.562581 0.612041 1.335967
C  -0.344818 -2.856723 -0.011577
C  0.080073 -0.98007 -1.455045
C  0.53929 -1.991778 -0.629165
C  -2.213091 2.004202 0.874467
C  -1.006052 2.233119 0.22311
C  -3.092458 3.060825 1.090259
C  -0.675054 3.515747 -0.199453
C  -2.754137 4.335533 0.662084
C  -1.549351 4.573032 0.018575
C  2.517847 -2.339022 0.65162
C  1.480141 2.892752 -0.979492
C  1.794783 2.409491 -2.240092
C  2.212022 2.506229 0.135017
C  2.862379 1.533415 -2.386557
C  3.268194 1.621283 -0.022567
C  3.596419 1.130789 -1.279978
H  -3.423149 0.824568 -1.058547
H  -5.05601 0.282436 -0.710693
H  -3.8851 -2.260918 -3.057133
H  -5.169625 -1.114711 -2.681453
H  -3.576174 -0.528576 -3.138955
H  -4.41513 -3.369588 -0.803459
H  -5.617309 -2.12134 -0.511554
H  -4.36716 -2.425794 0.684443
H  -2.379246 -3.330733 0.330224
H  -1.615016 -0.000491 -2.261633
H  -2.636388 0.598274 2.426565
H  -1.753738 -0.07614 1.070782
H  -0.013156 -3.681626 0.60322
H  0.782372 -0.316794 -1.944579
H  -0.338493 1.398894 0.046877
H  -4.035943 2.89238 1.594758
H  -3.433559 5.160941 0.832363
H  -1.288929 5.569028 -0.31759
H  1.216221 2.723908 -3.0997
H  1.964519 2.895069 1.115058
H  3.113301 1.160505 -3.371123
H  3.843542 1.322663 0.843358
H  4.425683 0.445932 -1.397354
elementType: Br F O C H
totalener: -3928.11085523 hartree
nucrepener: 3684.33696558 hartree
electener: -7612.44782081 hartree
twoeener: 5152.41779321 hartree
cpcmener: -0.02032619 hartree
kineticenergy: 3918.79353799 hartree
xcener: -198.388548944173 hartree
chargesum: -0.0000000
charge: -0.078604 -0.153009 -0.158964 -0.383795 -0.259888 -0.328915 0.384885 -0.084778 -0.065130 -0.343112 -0.375042 -0.178209 -0.251780 0.135543 -0.102934 -0.161434 0.129032 -0.021534 -0.194560 -0.264573 0.320823 -0.105397 -0.264578 0.444142 0.293070 -0.253203 -0.171528 -0.101708 -0.148234 -0.190543 0.109576 0.114832 0.107973 0.103749 0.103332 0.109109 0.103738 0.096283 0.142847 0.138047 0.114242 0.063386 0.152139 0.172703 0.105724 0.136333 0.155087 0.142746 0.144262 0.149279 0.157150 0.156319 0.155102
qa: -0.0786 -0.1530 -0.1590 -0.3838 -0.2599 -0.3289 0.3849 -0.0848 -0.0651 -0.3431 -0.3750 -0.1782 -0.2518 0.1355 -0.1029 -0.1614 0.1290 -0.0215 -0.1946 -0.2646 0.3208 -0.1054 -0.2646 0.4441 0.2931 -0.2532 -0.1715 -0.1017 -0.1482 -0.1905 0.1096 0.1148 0.1080 0.1037 0.1033 0.1091 0.1037 0.0963 0.1428 0.1380 0.1142 0.0634 0.1521 0.1727 0.1057 0.1363 0.1551 0.1427 0.1443 0.1493 0.1572 0.1563 0.1551
va: 1.1712 1.1405 1.1308 1.9357 2.1108 2.0882 3.5645 3.9573 3.5999 3.9308 3.9282 3.9459 4.0277 3.8685 3.9474 3.8977 3.8554 3.6407 3.8680 3.9879 3.6953 3.9022 3.9957 4.5341 3.6529 3.9808 3.9246 3.8223 3.8360 3.8525 0.9899 1.0076 1.0019 1.0043 1.0005 0.9994 1.0056 1.0134 1.0011 1.0085 0.9907 0.9914 1.0125 0.9965 1.0197 1.0137 0.9889 1.0101 1.0074 1.0009 0.9897 0.9939 0.9967
dispcorr: -0.035421648 hartree
energy: -3928.146276875274
dipole: -58.37506 57.66369 -0.71137 22.69100 -22.87608 -0.18508 -36.01498 35.34936 -0.66562
magnitude: 0.99164 au
magnitude: 2.52055 debye
