program: Orca
programVersion: 5.0.2
elementType: Br F F O O O C C C C C C C C C C C C C C C C C C C C C C C C H H H H H H H H H H H H H H H H H H H H H H H
charge: 0
multiplicity: 1
keywords: wb97x-d3
keywords: def2-TZVPP
keywords: def2/J RIJCOSX
keywords: DEFGRID2
keywords: scfconv7
keywords: smallprint printgap noloewdin
keywords: NOSOSCF
formula: C24H23BrF2O3
InChI: InChI=1/C24H23BrF2O3/c1-23(2,19-11-13-21(14-12-19)30-24(25,26)27)17-28-16-18-7-6-10-22(15-18)29-20-8-4-3-5-9-20/h3-15H,16-17H2,1-2H3
53 atoms
Br 1.638729 -0.425567 -2.247413
F  3.284925 -2.5503 -2.242352
F  3.196144 -1.525288 -0.361787
O  -3.257122 0.478754 0.564748
O  1.574994 -2.903957 -0.999531
O  1.123266 2.846732 -0.049309
C  -3.372442 -1.688419 1.566668
C  -4.063129 -0.667935 0.655231
C  -2.025188 -2.030497 0.939077
C  -4.26582 -2.930447 1.648623
C  -3.234764 -1.10934 2.975191
C  -0.81213 -1.648096 1.50436
C  -1.978105 -2.707583 -0.281469
C  -3.516637 1.298595 -0.544439
C  0.404595 -1.915017 0.887383
C  -0.779454 -2.976786 -0.918208
C  0.405175 -2.568998 -0.330211
C  -2.475079 2.381239 -0.594287
C  -1.150091 2.084256 -0.288997
C  -2.820709 3.678147 -0.95736
C  -0.195056 3.090357 -0.317669
C  -1.850564 4.66874 -1.013207
C  -0.53523 4.386043 -0.680434
C  2.453295 -1.974142 -1.380972
C  1.504535 2.096345 1.024961
C  0.743095 1.968943 2.181703
C  2.754905 1.496386 0.938046
C  1.239648 1.222118 3.241728
C  3.241757 0.764303 2.009413
C  2.485396 0.615116 3.164354
H  -4.22661 -1.108716 -0.338037
H  -5.055051 -0.419099 1.059975
H  -3.804028 -3.703059 2.265048
H  -5.226457 -2.678401 2.10218
H  -4.475424 -3.366754 0.671269
H  -2.762354 -1.822688 3.65305
H  -4.224212 -0.885235 3.378205
H  -2.656055 -0.1863 3.008599
H  -0.786624 -1.127507 2.451478
H  -2.891773 -3.026203 -0.766858
H  -3.48563 0.709207 -1.472556
H  -4.517922 1.746698 -0.492447
H  1.321926 -1.614119 1.375458
H  -0.766279 -3.497427 -1.86726
H  -0.86557 1.074178 -0.020656
H  -3.851199 3.917683 -1.189896
H  -2.123903 5.677268 -1.29528
H  0.221746 5.16007 -0.701245
H  -0.224632 2.445034 2.271467
H  3.343535 1.612217 0.037281
H  0.642634 1.124672 4.139564
H  4.218502 0.303682 1.936243
H  2.864623 0.036321 3.996285
elementType: Br F O C H
totalener: -3928.11450914 hartree
nucrepener: 3709.00259720 hartree
electener: -7637.11710634 hartree
twoeener: 5178.68169975 hartree
cpcmener: -0.02208196 hartree
kineticenergy: 3918.78006641 hartree
xcener: -198.381701024072 hartree
chargesum: -0.0000000
charge: -0.077378 -0.151821 -0.153138 -0.358561 -0.269320 -0.321627 0.381664 -0.082883 -0.040573 -0.334033 -0.362945 -0.229820 -0.204630 0.080475 -0.116423 -0.149454 0.124317 0.005003 -0.191129 -0.218602 0.292183 -0.114953 -0.253101 0.431448 0.352225 -0.213579 -0.272291 -0.173338 -0.120938 -0.180846 0.100384 0.107430 0.108826 0.103765 0.101828 0.112866 0.105012 0.092028 0.151722 0.140831 0.093643 0.090654 0.165678 0.147897 0.107510 0.138112 0.155303 0.143794 0.152004 0.138433 0.158944 0.152218 0.155187
qa: -0.0774 -0.1518 -0.1531 -0.3586 -0.2693 -0.3216 0.3817 -0.0829 -0.0406 -0.3340 -0.3629 -0.2298 -0.2046 0.0805 -0.1164 -0.1495 0.1243 0.0050 -0.1911 -0.2186 0.2922 -0.1150 -0.2531 0.4314 0.3522 -0.2136 -0.2723 -0.1733 -0.1209 -0.1808 0.1004 0.1074 0.1088 0.1038 0.1018 0.1129 0.1050 0.0920 0.1517 0.1408 0.0936 0.0907 0.1657 0.1479 0.1075 0.1381 0.1553 0.1438 0.1520 0.1384 0.1589 0.1522 0.1552
va: 1.1743 1.1431 1.1277 1.9461 2.1095 2.0788 3.5788 3.9616 3.6500 3.9196 3.9246 3.9504 4.0091 3.8942 3.9169 4.0193 3.8345 3.7359 3.9114 3.9530 3.6718 3.8976 4.0220 4.5460 3.6147 3.8592 3.9429 3.8578 3.8616 3.8705 0.9928 1.0013 1.0022 1.0036 1.0028 0.9995 1.0059 1.0119 0.9947 1.0026 0.9905 0.9928 1.0026 1.0037 1.0256 1.0058 0.9896 1.0076 1.0003 1.0155 0.9906 0.9932 0.9909
dispcorr: -0.034234533 hartree
energy: -3928.148743671625
dipole: -57.93416 55.63132 -2.30284 8.38611 -8.69748 -0.31137 46.57304 -46.07320 0.49984
magnitude: 2.37694 au
magnitude: 6.04171 debye
