program: Orca
programVersion: 5.0.2
elementType: Br F F O O O C C C C C C C C C C C C C C C C C C C C C C C C H H H H H H H H H H H H H H H H H H H H H H H
charge: 0
multiplicity: 1
keywords: wb97x-d3
keywords: def2-TZVPP
keywords: def2/J RIJCOSX
keywords: DEFGRID2
keywords: scfconv7
keywords: smallprint printgap noloewdin
keywords: NOSOSCF
formula: C24H23BrF2O3
InChI: InChI=1/C24H23BrF2O3/c1-23(2,19-11-13-21(14-12-19)30-24(25,26)27)17-28-16-18-7-6-10-22(15-18)29-20-8-4-3-5-9-20/h3-15H,16-17H2,1-2H3
53 atoms
Br 2.405134 -3.150944 0.868546
F  2.500116 -0.971544 -0.705282
F  2.87327 -2.805685 -1.755386
O  -4.340862 0.676447 -0.690056
O  0.847096 -2.345934 -1.279547
O  0.368544 3.881155 -0.290165
C  -3.97421 -0.691565 1.257975
C  -4.203368 0.722722 0.711868
C  -2.672877 -1.205625 0.65665
C  -5.173249 -1.576734 0.917784
C  -3.869333 -0.599183 2.783993
C  -2.633566 -2.204064 -0.311743
C  -1.460677 -0.613887 1.011075
C  -3.919279 1.841849 -1.36399
C  -1.441978 -2.588055 -0.909008
C  -0.260348 -0.969168 0.41839
C  -0.26493 -1.958048 -0.552092
C  -2.419946 1.898806 -1.507511
C  -1.675016 2.849687 -0.821774
C  -1.761814 0.960786 -2.300678
C  -0.291099 2.876374 -0.943753
C  -0.381305 0.992546 -2.413384
C  0.36682 1.950277 -1.74087
C  2.097082 -2.242874 -0.837914
C  1.574166 3.629425 0.305139
C  2.568887 4.586524 0.165274
C  1.790101 2.490831 1.072121
C  3.788253 4.401365 0.801627
C  3.018278 2.311453 1.69066
C  4.022116 3.262118 1.558736
H  -5.107553 1.1525 1.166575
H  -3.363573 1.361999 1.01129
H  -5.041747 -2.589928 1.302847
H  -6.073817 -1.167623 1.380167
H  -5.366296 -1.65047 -0.152278
H  -4.811297 -0.249564 3.211083
H  -3.090972 0.0900 3.113045
H  -3.6522 -1.576146 3.218273
H  -3.538894 -2.704768 -0.625404
H  -1.434626 0.173418 1.753555
H  -4.384161 1.808036 -2.352356
H  -4.287725 2.7482 -0.867324
H  -1.4354 -3.362261 -1.665922
H  0.635328 -0.444051 0.714009
H  -2.170114 3.583072 -0.195315
H  -2.32834 0.209152 -2.837065
H  0.127157 0.268628 -3.037588
H  1.443977 1.972094 -1.849334
H  2.387211 5.470686 -0.432877
H  1.00666 1.75432 1.197885
H  4.5618 5.150747 0.693634
H  3.185585 1.423599 2.286972
H  4.97711 3.117667 2.046384
elementType: Br F O C H
totalener: -3928.11316142 hartree
nucrepener: 3603.83189442 hartree
electener: -7531.94505583 hartree
twoeener: 5072.61135982 hartree
cpcmener: -0.02390931 hartree
kineticenergy: 3918.79895098 hartree
xcener: -198.385039446451 hartree
chargesum: -0.0000000
charge: -0.079742 -0.157088 -0.148140 -0.374572 -0.258488 -0.333498 0.390849 -0.089712 -0.034521 -0.360728 -0.337378 -0.179419 -0.280194 0.060414 -0.199852 -0.134419 0.214364 0.071791 -0.258584 -0.276399 0.280669 -0.100890 -0.207400 0.428023 0.245006 -0.212930 -0.154293 -0.143011 -0.189644 -0.158022 0.105906 0.103564 0.112572 0.102762 0.095219 0.103238 0.100837 0.108910 0.141403 0.144499 0.106991 0.098853 0.144493 0.154434 0.131935 0.138786 0.153893 0.149728 0.144585 0.167532 0.156833 0.153333 0.157499
qa: -0.0797 -0.1571 -0.1481 -0.3746 -0.2585 -0.3335 0.3908 -0.0897 -0.0345 -0.3607 -0.3374 -0.1794 -0.2802 0.0604 -0.1999 -0.1344 0.2144 0.0718 -0.2586 -0.2764 0.2807 -0.1009 -0.2074 0.4280 0.2450 -0.2129 -0.1543 -0.1430 -0.1896 -0.1580 0.1059 0.1036 0.1126 0.1028 0.0952 0.1032 0.1008 0.1089 0.1414 0.1445 0.1070 0.0989 0.1445 0.1544 0.1319 0.1388 0.1539 0.1497 0.1446 0.1675 0.1568 0.1533 0.1575
va: 1.1768 1.1278 1.1473 1.9301 2.1072 2.0708 3.5616 3.9847 3.6057 3.9152 3.9201 3.9841 4.1033 3.8986 4.0527 3.8814 3.6779 3.5426 3.9967 3.9401 3.7026 3.8077 3.8881 4.5653 3.7194 3.9798 3.8543 3.9002 3.9384 3.8807 1.0036 0.9852 0.9991 1.0054 1.0129 1.0041 1.0022 1.0020 0.9980 1.0028 0.9906 0.9949 1.0063 1.0025 1.0185 1.0097 0.9953 1.0030 1.0077 0.9836 0.9896 0.9946 0.9899
dispcorr: -0.033749187 hartree
energy: -3928.146910602630
dipole: -62.78105 61.93295 -0.84810 48.95888 -48.57056 0.38832 2.88920 -2.13520 0.75400
magnitude: 1.19941 au
magnitude: 3.04865 debye
