program: Orca
programVersion: 5.0.2
elementType: Br F F O O O C C C C C C C C C C C C C C C C C C C C C C C C H H H H H H H H H H H H H H H H H H H H H H H
charge: 0
multiplicity: 1
keywords: wb97x-d3
keywords: def2-TZVPP
keywords: def2/J RIJCOSX
keywords: DEFGRID2
keywords: scfconv7
keywords: smallprint printgap noloewdin
keywords: NOSOSCF
formula: C24H23BrF2O3
InChI: InChI=1/C24H23BrF2O3/c1-23(2,19-11-13-21(14-12-19)30-24(25,26)27)17-28-16-18-7-6-10-22(15-18)29-20-8-4-3-5-9-20/h3-15H,16-17H2,1-2H3
53 atoms
Br 1.86937 -3.874899 0.69832
F  3.614498 -1.921157 1.305269
F  2.959781 -1.894873 -0.735403
O  -3.588906 1.42857 -1.245406
O  1.672686 -1.114805 0.907758
O  1.046546 2.238552 1.05961
C  -3.721912 -0.953894 -0.933127
C  -4.281279 0.41862 -0.548324
C  -2.2686 -1.015244 -0.480569
C  -3.877247 -1.176072 -2.438443
C  -4.557313 -2.017764 -0.212912
C  -1.957179 -1.072639 0.879472
C  -1.206156 -0.959298 -1.376518
C  -3.567624 2.674344 -0.589191
C  -0.647902 -1.118695 1.325023
C  0.116213 -0.98663 -0.951976
C  0.380681 -1.090069 0.400234
C  -2.559198 2.715349 0.530684
C  -1.221213 2.449243 0.249786
C  -2.942163 3.003448 1.834645
C  -0.27718 2.513197 1.263316
C  -1.992856 3.040624 2.847993
C  -0.657606 2.80423 2.568314
C  2.545842 -2.048259 0.529291
C  1.706957 2.670806 -0.054605
C  2.798451 1.909579 -0.455717
C  1.376465 3.837138 -0.735867
C  3.548184 2.3066 -1.552139
C  2.131641 4.216159 -1.837655
C  3.214512 3.455763 -2.256237
H  -5.353263 0.460374 -0.789172
H  -4.194839 0.550952 0.537874
H  -3.489234 -2.151453 -2.735463
H  -4.934745 -1.15176 -2.706799
H  -3.375959 -0.421748 -3.044057
H  -4.168061 -3.017618 -0.408812
H  -5.589932 -1.991388 -0.565207
H  -4.582705 -1.878076 0.868396
H  -2.744467 -1.08515 1.622188
H  -1.385744 -0.889736 -2.43974
H  -3.30534 3.415636 -1.347169
H  -4.559745 2.945627 -0.209466
H  -0.429002 -1.175893 2.383488
H  0.906844 -0.915832 -1.685523
H  -0.922899 2.205522 -0.763072
H  -3.983365 3.198799 2.059855
H  -2.293768 3.261046 3.864172
H  0.087952 2.841731 3.352806
H  3.067444 1.019256 0.096324
H  0.544432 4.453393 -0.420059
H  4.395911 1.706605 -1.857674
H  1.867677 5.122197 -2.367945
H  3.795782 3.75934 -3.117004
elementType: Br F O C H
totalener: -3928.11519454 hartree
nucrepener: 3624.26808015 hartree
electener: -7552.38327469 hartree
twoeener: 5094.05128301 hartree
cpcmener: -0.02348368 hartree
kineticenergy: 3918.81154449 hartree
xcener: -198.386051704208 hartree
chargesum: -0.0000000
charge: -0.072718 -0.155266 -0.164657 -0.374483 -0.279066 -0.327610 0.394014 -0.096632 -0.004931 -0.363062 -0.335545 -0.209046 -0.219537 0.072043 -0.172560 -0.095759 0.119322 0.044584 -0.266266 -0.203934 0.301722 -0.111185 -0.265008 0.449048 0.320905 -0.275796 -0.212337 -0.122761 -0.152178 -0.187164 0.106696 0.104169 0.113769 0.102882 0.095353 0.109541 0.102796 0.100535 0.139068 0.142872 0.107408 0.097012 0.144508 0.145039 0.140101 0.140387 0.156377 0.144435 0.148988 0.154620 0.154595 0.158084 0.156631
qa: -0.0727 -0.1553 -0.1647 -0.3745 -0.2791 -0.3276 0.3940 -0.0966 -0.0049 -0.3631 -0.3355 -0.2090 -0.2195 0.0720 -0.1726 -0.0958 0.1193 0.0446 -0.2663 -0.2039 0.3017 -0.1112 -0.2650 0.4490 0.3209 -0.2758 -0.2123 -0.1228 -0.1522 -0.1872 0.1067 0.1042 0.1138 0.1029 0.0954 0.1095 0.1028 0.1005 0.1391 0.1429 0.1074 0.0970 0.1445 0.1450 0.1401 0.1404 0.1564 0.1444 0.1490 0.1546 0.1546 0.1581 0.1566
va: 1.1880 1.1413 1.1294 1.9321 2.0625 2.0453 3.5465 4.0072 3.5612 3.9181 3.9193 3.9675 3.9886 3.8984 3.9859 3.9468 3.6953 3.5906 3.9242 3.9153 3.5923 3.8908 4.0397 4.5383 3.6851 3.9310 3.9038 3.8977 3.9005 3.9138 1.0024 0.9836 0.9997 1.0050 1.0130 1.0017 1.0046 1.0030 1.0030 0.9995 0.9908 0.9953 1.0066 1.0136 1.0113 1.0042 0.9888 1.0076 1.0268 0.9982 0.9918 0.9906 0.9906
dispcorr: -0.033823423 hartree
energy: -3928.149017959855
dipole: -61.68715 59.61195 -2.07520 58.86071 -58.18934 0.67137 -17.05200 16.97216 -0.07984
magnitude: 2.18256 au
magnitude: 5.54764 debye
