program: Orca
programVersion: 5.0.2
elementType: Br F F O O O C C C C C C C C C C C C C C C C C C C C C C C C H H H H H H H H H H H H H H H H H H H H H H H
charge: 0
multiplicity: 1
keywords: wb97x-d3
keywords: def2-TZVPP
keywords: def2/J RIJCOSX
keywords: DEFGRID2
keywords: scfconv7
keywords: smallprint printgap noloewdin
keywords: NOSOSCF
formula: C24H23BrF2O3
InChI: InChI=1/C24H23BrF2O3/c1-23(2,19-11-13-21(14-12-19)30-24(25,26)27)17-28-16-18-7-6-10-22(15-18)29-20-8-4-3-5-9-20/h3-15H,16-17H2,1-2H3
53 atoms
Br 1.952835 -1.286614 2.074316
F  3.302439 -1.64446 -0.212806
F  3.462018 -3.309073 1.128689
O  -3.5521 0.13185 0.574885
O  1.650087 -3.114861 0.006659
O  0.924293 2.558114 0.775748
C  -3.443763 -1.046919 -1.500335
C  -3.643024 0.306481 -0.812508
C  -2.083857 -1.606481 -1.09875
C  -3.494383 -0.821371 -3.016287
C  -4.598344 -1.973634 -1.118307
C  -0.91822 -0.9269 -1.449207
C  -1.940283 -2.779923 -0.367756
C  -3.779214 1.291105 1.321098
C  0.341556 -1.381768 -1.096875
C  -0.691045 -3.252293 0.00334
C  0.441835 -2.550291 -0.359828
C  -2.697308 2.335038 1.18177
C  -1.368172 1.956164 1.027341
C  -3.017424 3.686471 1.235097
C  -0.386026 2.928266 0.921538
C  -2.024271 4.650232 1.151054
C  -0.700078 4.27703 0.984567
C  2.609017 -2.425187 0.627775
C  1.370027 2.196159 -0.456097
C  2.648524 1.650716 -0.511982
C  0.630041 2.361361 -1.621636
C  3.179678 1.270093 -1.731609
C  1.176727 1.969185 -2.836786
C  2.447347 1.420896 -2.902544
H  -2.893815 1.025062 -1.173565
H  -4.629155 0.712759 -1.090095
H  -2.725146 -0.130668 -3.362472
H  -3.354651 -1.761539 -3.549931
H  -4.461679 -0.410908 -3.313219
H  -5.544133 -1.534485 -1.440635
H  -4.665341 -2.136261 -0.043639
H  -4.509717 -2.944514 -1.608291
H  -0.970191 -0.005662 -2.014644
H  -2.80824 -3.346335 -0.062502
H  -4.750902 1.74313 1.07044
H  -3.841218 0.97005 2.364386
H  1.21256 -0.820637 -1.406558
H  -0.596869 -4.1631 0.579533
H  -1.093922 0.908169 0.980109
H  -4.051946 3.990058 1.343561
H  -2.283816 5.699494 1.198822
H  0.084293 5.017825 0.902028
H  3.211573 1.523474 0.402809
H  -0.361378 2.793658 -1.593951
H  4.173935 0.845174 -1.765247
H  0.596918 2.102731 -3.741099
H  2.864661 1.117205 -3.852737
totalener: -3928.09346849 hartree
nucrepener: 3695.32910026 hartree
electener: -7623.42256874 hartree
twoeener: 5163.51351122 hartree
kineticenergy: 3918.83184078 hartree
xcener: -198.391781249483 hartree
chargesum: -0.0000000
charge: -0.077577 -0.153418 -0.142504 -0.311062 -0.254282 -0.295779 0.313170 -0.065514 0.048461 -0.301848 -0.355323 -0.257155 -0.151197 0.038348 -0.068855 -0.102046 0.079409 0.025913 -0.224895 -0.154735 0.224291 -0.109007 -0.160450 0.425730 0.340349 -0.256722 -0.237354 -0.075154 -0.124317 -0.157297 0.087160 0.088739 0.091584 0.106156 0.092741 0.087998 0.105768 0.102195 0.095623 0.115412 0.076863 0.098098 0.136949 0.123378 0.140074 0.109336 0.126944 0.126624 0.124717 0.128753 0.125955 0.126352 0.123403
qa: -0.0776 -0.1534 -0.1425 -0.3111 -0.2543 -0.2958 0.3132 -0.0655 0.0485 -0.3018 -0.3553 -0.2572 -0.1512 0.0383 -0.0689 -0.1020 0.0794 0.0259 -0.2249 -0.1547 0.2243 -0.1090 -0.1604 0.4257 0.3403 -0.2567 -0.2374 -0.0752 -0.1243 -0.1573 0.0872 0.0887 0.0916 0.1062 0.0927 0.0880 0.1058 0.1022 0.0956 0.1154 0.0769 0.0981 0.1369 0.1234 0.1401 0.1093 0.1269 0.1266 0.1247 0.1288 0.1260 0.1264 0.1234
va: 1.1739 1.1279 1.1572 1.9814 2.1318 2.1094 3.7099 3.9460 3.6195 3.9306 3.9258 4.0490 4.0143 3.9368 3.9508 4.0360 3.9668 3.6027 3.9947 3.9777 3.7952 3.9536 4.0347 4.5557 3.6866 3.9824 3.8707 3.8897 3.9128 3.9383 0.9843 1.0068 1.0035 1.0063 1.0060 1.0110 1.0110 1.0017 1.0248 1.0070 0.9989 0.9889 1.0019 1.0131 1.0110 1.0099 0.9998 1.0095 1.0203 1.0123 1.0020 1.0013 1.0014
dispcorr: -0.034968119 hartree
energy: -3928.128436606522
dipole: -62.98188 61.49021 -1.49167 27.68796 -26.97725 0.71071 -40.70842 40.08709 -0.62133
magnitude: 1.76529 au
magnitude: 4.48701 debye
