program: Orca
programVersion: 5.0.2
elementType: Br F F O O O C C C C C C C C C C C C C C C C C C C C C C C C H H H H H H H H H H H H H H H H H H H H H H H
charge: 0
multiplicity: 1
keywords: wb97x-d3
keywords: def2-TZVPP
keywords: def2/J RIJCOSX
keywords: DEFGRID2
keywords: scfconv7
keywords: smallprint printgap noloewdin
keywords: NOSOSCF
formula: C24H23BrF2O3
InChI: InChI=1/C24H23BrF2O3/c1-23(2,19-11-13-21(14-12-19)30-24(25,26)27)17-28-16-18-7-6-10-22(15-18)29-20-8-4-3-5-9-20/h3-15H,16-17H2,1-2H3
53 atoms
Br 1.837826 -0.35421 -1.88963
F  2.046401 -3.020576 -1.819382
F  3.80126 -2.01799 -1.091647
O  -3.439742 0.34812 -0.132454
O  2.112276 -2.138603 0.220279
O  1.022735 2.816763 -0.392057
C  -3.215925 -0.957997 1.854553
C  -3.542383 0.41715 1.2634
C  -1.801781 -1.337091 1.432047
C  -4.26222 -1.968933 1.382836
C  -3.302617 -0.856511 3.382011
C  -1.528678 -2.419438 0.603651
C  -0.720529 -0.564219 1.854485
C  -3.69701 1.550263 -0.795119
C  -0.237632 -2.715034 0.187465
C  0.572517 -0.833902 1.446557
C  0.80131 -1.902833 0.599563
C  -2.613315 2.589893 -0.633393
C  -1.276984 2.212262 -0.547015
C  -2.940829 3.940373 -0.616241
C  -0.295527 3.186307 -0.452832
C  -1.94952 4.90645 -0.535192
C  -0.617728 4.534912 -0.448136
C  2.476301 -2.003928 -1.058563
C  1.567176 2.527658 0.8191
C  2.873819 2.048133 0.807981
C  0.893311 2.687419 2.024536
C  3.491872 1.711354 1.999117
C  1.529943 2.345747 3.211165
C  2.823736 1.851026 3.209507
H  -4.560738 0.712039 1.564568
H  -2.859462 1.17336 1.675623
H  -4.074606 -2.959236 1.800719
H  -5.253139 -1.659106 1.718757
H  -4.299613 -2.056089 0.298102
H  -3.053016 -1.811743 3.844026
H  -4.313897 -0.589635 3.69539
H  -2.624706 -0.107535 3.792215
H  -2.32866 -3.055616 0.2537
H  -0.874082 0.288851 2.502721
H  -3.793844 1.295954 -1.854171
H  -4.661047 1.980687 -0.484531
H  -0.061598 -3.569147 -0.45109
H  1.3948 -0.212093 1.774481
H  -0.995965 1.165232 -0.551811
H  -3.980219 4.241935 -0.670554
H  -2.215606 5.955129 -0.52874
H  0.166873 5.276778 -0.376464
H  3.390019 1.93241 -0.135314
H  -0.117786 3.071217 2.049555
H  4.504395 1.330372 1.979156
H  0.99948 2.471041 4.146336
H  3.309003 1.581297 4.137418
totalener: -3928.09394368 hartree
nucrepener: 3724.75018342 hartree
electener: -7652.84412710 hartree
twoeener: 5193.03205396 hartree
kineticenergy: 3918.83908374 hartree
xcener: -198.394717034836 hartree
chargesum: -0.0000000
charge: -0.078175 -0.159204 -0.144758 -0.311545 -0.258424 -0.298685 0.318157 -0.067719 0.036545 -0.354759 -0.301208 -0.159266 -0.248585 0.038925 -0.065702 -0.066461 0.055900 0.003932 -0.204705 -0.150856 0.235203 -0.111718 -0.152704 0.437927 0.333145 -0.254825 -0.244558 -0.062465 -0.114520 -0.169193 0.087277 0.091016 0.102977 0.087714 0.106617 0.107281 0.092719 0.090470 0.115602 0.101366 0.098777 0.077013 0.125294 0.123286 0.123362 0.109461 0.127057 0.127470 0.126216 0.124986 0.125308 0.125723 0.123308
qa: -0.0782 -0.1592 -0.1448 -0.3115 -0.2584 -0.2987 0.3182 -0.0677 0.0365 -0.3548 -0.3012 -0.1593 -0.2486 0.0389 -0.0657 -0.0665 0.0559 0.0039 -0.2047 -0.1509 0.2352 -0.1117 -0.1527 0.4379 0.3331 -0.2548 -0.2446 -0.0625 -0.1145 -0.1692 0.0873 0.0910 0.1030 0.0877 0.1066 0.1073 0.0927 0.0905 0.1156 0.1014 0.0988 0.0770 0.1253 0.1233 0.1234 0.1095 0.1271 0.1275 0.1262 0.1250 0.1253 0.1257 0.1233
va: 1.1841 1.1322 1.1560 1.9833 2.1180 2.0980 3.7129 3.9497 3.6059 3.9290 3.9278 4.0186 4.0205 3.9371 4.0092 3.9427 4.0011 3.6517 3.9975 3.9744 3.7628 3.9623 4.0346 4.5365 3.6758 4.0045 3.8856 3.9156 3.9137 3.9575 1.0064 0.9848 1.0010 1.0111 1.0107 1.0057 1.0064 1.0048 1.0086 1.0170 0.9882 0.9987 1.0198 0.9948 1.0222 1.0095 0.9999 1.0085 1.0223 1.0144 0.9999 1.0010 1.0022
dispcorr: -0.035277695 hartree
energy: -3928.129221379086
dipole: -57.35034 55.90016 -1.45018 19.88367 -19.18855 0.69511 46.98395 -46.12132 0.86263
magnitude: 1.82492 au
magnitude: 4.63858 debye
