program: Orca
programVersion: 5.0.2
elementType: Br F F O O O C C C C C C C C C C C C C C C C C C C C C C C C H H H H H H H H H H H H H H H H H H H H H H H
charge: 0
multiplicity: 1
keywords: wb97x-d3
keywords: def2-TZVPP
keywords: def2/J RIJCOSX
keywords: DEFGRID2
keywords: scfconv7
keywords: smallprint printgap noloewdin
keywords: NOSOSCF
formula: C24H23BrF2O3
InChI: InChI=1/C24H23BrF2O3/c1-23(2,19-11-13-21(14-12-19)30-24(25,26)27)17-28-16-18-7-6-10-22(15-18)29-20-8-4-3-5-9-20/h3-15H,16-17H2,1-2H3
53 atoms
Br 3.950961 -1.48837 -1.878663
F  1.882254 -3.196695 -1.922253
F  2.516739 -2.674506 0.054591
O  -3.906333 0.592345 0.803655
O  1.407771 -1.169453 -1.153415
O  0.486776 2.77928 -0.313559
C  -3.771991 -1.759893 1.150054
C  -4.577591 -0.605021 0.542391
C  -2.362642 -1.68628 0.574551
C  -4.44777 -3.080446 0.767492
C  -3.791064 -1.638167 2.674578
C  -1.260282 -1.33454 1.345282
C  -2.152795 -1.897836 -0.787973
C  -4.283146 1.685842 0.020328
C  0.003063 -1.192708 0.790986
C  -0.900739 -1.760953 -1.362455
C  0.168772 -1.401043 -0.563022
C  -3.158331 2.682871 -0.038345
C  -1.838495 2.249286 -0.088425
C  -3.435593 4.043214 -0.109137
C  -0.816526 3.179611 -0.207905
C  -2.40676 4.962411 -0.241116
C  -1.088919 4.536813 -0.283752
C  2.291126 -2.172884 -1.163495
C  1.097179 2.144488 0.722305
C  0.596809 2.128052 2.018908
C  2.303735 1.517101 0.430059
C  1.310452 1.475156 3.014659
C  3.00418 0.872768 1.434568
C  2.512394 0.844065 2.733716
H  -4.686403 -0.761305 -0.541891
H  -5.594502 -0.600863 0.964975
H  -3.897244 -3.92696 1.178142
H  -5.464307 -3.121858 1.163589
H  -4.512786 -3.224332 -0.31123
H  -3.209163 -2.433235 3.143257
H  -4.816018 -1.727698 3.038231
H  -3.406207 -0.680706 3.022638
H  -1.368913 -1.14135 2.402446
H  -2.980308 -2.165234 -1.432874
H  -4.518081 1.361975 -1.005359
H  -5.192068 2.167217 0.408827
H  0.836506 -0.887574 1.408797
H  -0.76384 -1.908176 -2.425253
H  -1.60322 1.193129 -0.035979
H  -4.461704 4.387371 -0.061822
H  -2.630259 6.019436 -0.297548
H  -0.275045 5.243183 -0.379955
H  -0.338601 2.615165 2.259124
H  2.678612 1.530257 -0.584464
H  0.917266 1.467681 4.022964
H  3.9380 0.381179 1.194932
H  3.061109 0.337271 3.515858
totalener: -3928.09075393 hartree
nucrepener: 3609.03421492 hartree
electener: -7537.12496885 hartree
twoeener: 5077.36004938 hartree
kineticenergy: 3918.86121107 hartree
xcener: -198.393965271861 hartree
chargesum: 0.0000000
charge: -0.048570 -0.155498 -0.155804 -0.312799 -0.285375 -0.296353 0.312691 -0.066674 -0.039593 -0.294039 -0.356330 -0.124741 -0.152390 0.051440 -0.168284 -0.173435 0.218864 -0.016660 -0.069346 -0.143826 0.167267 -0.120855 -0.152613 0.427061 0.296436 -0.168207 -0.216567 -0.155412 -0.089370 -0.148290 0.082046 0.088390 0.107248 0.093686 0.089448 0.106064 0.089579 0.105266 0.110266 0.105791 0.078586 0.074885 0.139090 0.124010 0.075763 0.106007 0.124053 0.124705 0.124598 0.120309 0.123708 0.120491 0.123284
qa: -0.0486 -0.1555 -0.1558 -0.3128 -0.2854 -0.2964 0.3127 -0.0667 -0.0396 -0.2940 -0.3563 -0.1247 -0.1524 0.0514 -0.1683 -0.1734 0.2189 -0.0167 -0.0693 -0.1438 0.1673 -0.1209 -0.1526 0.4271 0.2964 -0.1682 -0.2166 -0.1554 -0.0894 -0.1483 0.0820 0.0884 0.1072 0.0937 0.0894 0.1061 0.0896 0.1053 0.1103 0.1058 0.0786 0.0749 0.1391 0.1240 0.0758 0.1060 0.1241 0.1247 0.1246 0.1203 0.1237 0.1205 0.1233
va: 1.1824 1.1442 1.1416 1.9889 2.0984 2.1066 3.7149 3.9745 3.7155 3.9217 3.9265 3.9392 4.0027 3.9331 4.0352 4.1754 3.7608 3.8013 3.8757 3.9574 3.8574 3.9749 4.0132 4.5449 3.7760 3.8733 3.9246 3.9405 3.8772 3.9335 0.9973 1.0005 1.0051 1.0064 1.0068 1.0009 1.0106 1.0104 1.0137 1.0126 0.9879 0.9937 1.0074 1.0116 1.0295 1.0137 1.0006 1.0110 1.0115 1.0239 1.0017 1.0058 1.0014
dispcorr: -0.034141609 hartree
energy: -3928.124895533949
dipole: -85.96119 84.37631 -1.58488 23.71980 -23.63799 0.08181 38.85889 -38.53187 0.32702
magnitude: 1.62033 au
magnitude: 4.11856 debye
