program: Orca
programVersion: 5.0.2
elementType: Br F F O O O C C C C C C C C C C C C C C C C C C C C C C C C H H H H H H H H H H H H H H H H H H H H H H H
charge: 0
multiplicity: 1
keywords: wb97x-d3
keywords: def2-TZVPP
keywords: def2/J RIJCOSX
keywords: DEFGRID2
keywords: scfconv7
keywords: smallprint printgap noloewdin
keywords: NOSOSCF
formula: C24H23BrF2O3
InChI: InChI=1/C24H23BrF2O3/c1-23(2,19-11-13-21(14-12-19)30-24(25,26)27)17-28-16-18-7-6-10-22(15-18)29-20-8-4-3-5-9-20/h3-15H,16-17H2,1-2H3
53 atoms
Br 2.366988 -3.411714 -0.733159
F  3.008885 -1.067558 0.390574
F  3.641669 -1.2231 -1.652303
O  -4.313204 0.715091 -0.437111
O  1.571497 -0.816229 -1.293192
O  0.424536 2.386155 -0.676177
C  -3.772021 -1.373491 0.607918
C  -4.272541 0.062548 0.803106
C  -2.332462 -1.304192 0.111815
C  -4.693019 -2.110566 -0.366654
C  -3.85134 -2.089682 1.961367
C  -1.304612 -0.949057 0.983744
C  -1.991504 -1.507764 -1.221505
C  -4.409137 2.108037 -0.353589
C  0.005964 -0.799295 0.56254
C  -0.684985 -1.368584 -1.664974
C  0.306924 -1.012039 -0.771675
C  -3.109556 2.782795 0.015331
C  -1.901144 2.260041 -0.430242
C  -3.111316 3.955528 0.76012
C  -0.714611 2.9183 -0.149035
C  -1.919807 4.612725 1.029683
C  -0.714054 4.105833 0.574239
C  2.636175 -1.473427 -0.826746
C  1.569807 2.297142 0.052522
C  2.756951 2.260032 -0.668361
C  1.589569 2.181044 1.437688
C  3.960498 2.10734 -0.002289
C  2.804944 2.03433 2.091127
C  3.994012 1.997362 1.380503
H  -5.275366 0.043605 1.258614
H  -3.608104 0.584402 1.50631
H  -4.345905 -3.130486 -0.539154
H  -5.699401 -2.172311 0.050787
H  -4.777656 -1.610838 -1.329615
H  -3.435187 -3.094799 1.892073
H  -4.89002 -2.181239 2.283293
H  -3.316545 -1.565121 2.753479
H  -1.517927 -0.761767 2.027774
H  -2.747519 -1.776796 -1.94479
H  -4.721837 2.450849 -1.343789
H  -5.197524 2.418079 0.348197
H  0.764968 -0.497138 1.268854
H  -0.438979 -1.526743 -2.706521
H  -1.871691 1.341515 -1.002837
H  -4.046058 4.362327 1.127236
H  -1.927295 5.531719 1.600971
H  0.2121 4.62711 0.778853
H  2.724636 2.339669 -1.746815
H  0.668578 2.197733 2.005734
H  4.879951 2.074364 -0.571613
H  2.815156 1.942205 3.169431
H  4.93625 1.877986 1.897442
totalener: -3928.09135457 hartree
nucrepener: 3661.96033528 hartree
electener: -7590.05168985 hartree
twoeener: 5130.53902703 hartree
kineticenergy: 3918.84744889 hartree
xcener: -198.395139272213 hartree
chargesum: -0.0000000
charge: -0.077153 -0.154321 -0.148260 -0.317108 -0.266371 -0.287652 0.326511 -0.089266 0.013620 -0.339852 -0.306857 -0.181885 -0.185534 0.033863 -0.134066 -0.097168 0.100358 0.023219 -0.242819 -0.161006 0.263666 -0.103108 -0.202769 0.453531 0.322367 -0.256405 -0.257342 -0.067412 -0.093829 -0.153166 0.088368 0.101625 0.111241 0.088659 0.100415 0.110654 0.093130 0.089452 0.104394 0.111443 0.096087 0.078462 0.139780 0.124347 0.151872 0.106702 0.125849 0.133128 0.121418 0.138298 0.123190 0.125531 0.122170
qa: -0.0772 -0.1543 -0.1483 -0.3171 -0.2664 -0.2877 0.3265 -0.0893 0.0136 -0.3399 -0.3069 -0.1819 -0.1855 0.0339 -0.1341 -0.0972 0.1004 0.0232 -0.2428 -0.1610 0.2637 -0.1031 -0.2028 0.4535 0.3224 -0.2564 -0.2573 -0.0674 -0.0938 -0.1532 0.0884 0.1016 0.1112 0.0887 0.1004 0.1107 0.0931 0.0895 0.1044 0.1114 0.0961 0.0785 0.1398 0.1243 0.1519 0.1067 0.1258 0.1331 0.1214 0.1383 0.1232 0.1255 0.1222
va: 1.1881 1.1469 1.1533 1.9875 2.0950 2.0814 3.6918 3.9884 3.5753 3.9234 3.9177 4.0405 4.0361 3.9440 4.0267 4.0375 3.8471 3.6269 4.0050 3.9847 3.8164 3.9521 3.9688 4.5366 3.5948 4.0362 3.9129 3.8938 3.9489 3.9706 1.0041 0.9824 1.0003 1.0099 1.0138 1.0039 1.0077 1.0060 1.0165 1.0121 0.9876 0.9966 1.0055 1.0126 0.9992 1.0102 1.0005 1.0051 1.0188 1.0060 0.9987 0.9989 1.0010
dispcorr: -0.035122016 hartree
energy: -3928.126476584078
dipole: -66.62295 65.46512 -1.15783 46.59375 -46.20858 0.38517 20.74927 -19.95678 0.79248
magnitude: 1.45498 au
magnitude: 3.69827 debye
