program: Orca
programVersion: 5.0.2
elementType: Br F F O O O C C C C C C C C C C C C C C C C C C C C C C C C H H H H H H H H H H H H H H H H H H H H H H H
charge: 0
multiplicity: 1
keywords: wb97x-d3
keywords: def2-TZVPP
keywords: def2/J RIJCOSX
keywords: DEFGRID2
keywords: scfconv7
keywords: smallprint printgap noloewdin
keywords: NOSOSCF
formula: C24H23BrF2O3
InChI: InChI=1/C24H23BrF2O3/c1-23(2,19-11-13-21(14-12-19)30-24(25,26)27)17-28-16-18-7-6-10-22(15-18)29-20-8-4-3-5-9-20/h3-15H,16-17H2,1-2H3
53 atoms
Br 1.992567 -1.263223 2.119912
F  3.287024 -1.666067 -0.193905
F  3.53658 -3.270671 1.205578
O  -3.30173 0.551419 -0.26995
O  1.690553 -3.175267 0.131766
O  0.939495 3.005268 0.760389
C  -3.460662 -1.435484 -1.590479
C  -4.072974 -0.594549 -0.464095
C  -2.066933 -1.880062 -1.157548
C  -3.419223 -0.618704 -2.88629
C  -4.392517 -2.630145 -1.819827
C  -1.876006 -3.064328 -0.449575
C  -0.937503 -1.10168 -1.403475
C  -3.664368 1.325381 0.836272
C  -0.622988 -3.457379 -0.012454
C  0.330781 -1.480169 -0.987182
C  0.476372 -2.66497 -0.285399
C  -2.667325 2.437633 0.997297
C  -1.31563 2.188837 0.791068
C  -3.080813 3.710536 1.370145
C  -0.397895 3.218299 0.936138
C  -2.151256 4.725243 1.539908
C  -0.80534 4.489496 1.312338
C  2.643622 -2.432854 0.696157
C  1.399089 2.436059 -0.387173
C  0.711699 2.487227 -1.595353
C  2.645706 1.826369 -0.317423
C  1.280385 1.916542 -2.72514
C  3.205784 1.274526 -1.45715
C  2.525472 1.308566 -2.666616
H  -5.110021 -0.330985 -0.729092
H  -4.120809 -1.199285 0.455474
H  -2.97181 -1.198583 -3.694512
H  -4.432677 -0.351294 -3.19079
H  -2.862298 0.31038 -2.7872
H  -4.610884 -3.181454 -0.904311
H  -3.965049 -3.330752 -2.537451
H  -5.348706 -2.289953 -2.219727
H  -2.712585 -3.710486 -0.222958
H  -1.020273 -0.168551 -1.941438
H  -4.675269 1.743534 0.720974
H  -3.684587 0.709376 1.748689
H  -0.496015 -4.381134 0.536149
H  1.170719 -0.842658 -1.228042
H  -0.97836 1.198493 0.509423
H  -4.133763 3.913656 1.522432
H  -2.478943 5.714534 1.830445
H  -0.072692 5.277939 1.422322
H  -0.253837 2.970421 -1.663489
H  3.167948 1.791298 0.62925
H  0.743199 1.961397 -3.663727
H  4.180111 0.809124 -1.395971
H  2.962782 0.870241 -3.553282
totalener: -3928.09274422 hartree
nucrepener: 3649.20942464 hartree
electener: -7577.30216886 hartree
twoeener: 5117.40747869 hartree
kineticenergy: 3918.82969410 hartree
xcener: -198.389454434466 hartree
chargesum: -0.0000000
charge: -0.076934 -0.153366 -0.141800 -0.309839 -0.250741 -0.296165 0.278143 -0.056338 0.063559 -0.329328 -0.313561 -0.198113 -0.269675 0.062007 -0.118788 -0.031815 0.085816 0.009095 -0.166071 -0.175978 0.218773 -0.094866 -0.196528 0.423644 0.310672 -0.188752 -0.249433 -0.142123 -0.088420 -0.140983 0.084968 0.086410 0.110706 0.086884 0.098024 0.084825 0.117411 0.093977 0.119034 0.124693 0.067651 0.084982 0.125119 0.129311 0.136831 0.105986 0.123477 0.124688 0.131311 0.124859 0.127418 0.126064 0.123278
qa: -0.0769 -0.1534 -0.1418 -0.3098 -0.2507 -0.2962 0.2781 -0.0563 0.0636 -0.3293 -0.3136 -0.1981 -0.2697 0.0620 -0.1188 -0.0318 0.0858 0.0091 -0.1661 -0.1760 0.2188 -0.0949 -0.1965 0.4236 0.3107 -0.1888 -0.2494 -0.1421 -0.0884 -0.1410 0.0850 0.0864 0.1107 0.0869 0.0980 0.0848 0.1174 0.0940 0.1190 0.1247 0.0677 0.0850 0.1251 0.1293 0.1368 0.1060 0.1235 0.1247 0.1313 0.1249 0.1274 0.1261 0.1233
va: 1.1729 1.1267 1.1580 2.0018 2.1363 2.1143 3.7215 3.9745 3.6225 3.9265 3.9079 4.0499 4.0749 3.9243 4.0493 3.8726 3.9626 3.8069 3.9404 3.9928 3.8217 3.9536 4.0460 4.5621 3.7371 3.8810 3.9760 3.9126 3.8709 3.9036 0.9964 0.9979 1.0021 1.0085 1.0150 1.0058 1.0024 1.0094 1.0038 1.0059 0.9935 0.9867 1.0125 1.0078 1.0048 1.0131 1.0002 1.0124 1.0075 1.0191 1.0007 1.0042 1.0015
dispcorr: -0.033096339 hartree
energy: -3928.125840557693
dipole: -63.94318 62.30501 -1.63817 23.04745 -22.97090 0.07655 -40.52682 40.16789 -0.35893
magnitude: 1.67878 au
magnitude: 4.26711 debye
