program: Orca
programVersion: 5.0.2
elementType: Br F F O O O C C C C C C C C C C C C C C C C C C C C C C C C H H H H H H H H H H H H H H H H H H H H H H H
charge: 0
multiplicity: 1
keywords: wb97x-d3
keywords: def2-TZVPP
keywords: def2/J RIJCOSX
keywords: DEFGRID2
keywords: scfconv7
keywords: smallprint printgap noloewdin
keywords: NOSOSCF
formula: C24H23BrF2O3
InChI: InChI=1/C24H23BrF2O3/c1-23(2,19-11-13-21(14-12-19)30-24(25,26)27)17-28-16-18-7-6-10-22(15-18)29-20-8-4-3-5-9-20/h3-15H,16-17H2,1-2H3
53 atoms
Br 3.050795 -2.813287 -0.820849
F  3.431165 -3.069224 1.825823
F  2.933269 -1.071076 1.219146
O  -3.49946 0.853304 -0.025492
O  1.382624 -2.651407 1.397257
O  0.632856 3.459186 1.011806
C  -3.50608 -1.244292 -1.17933
C  -4.240929 -0.31548 -0.202973
C  -2.167705 -1.630487 -0.558373
C  -3.320616 -0.541099 -2.528508
C  -4.405122 -2.463368 -1.405828
C  -1.04427 -0.817783 -0.687382
C  -2.02934 -2.777694 0.219818
C  -3.943148 1.690478 1.002065
C  0.161503 -1.108306 -0.065264
C  -0.832296 -3.099863 0.83553
C  0.259083 -2.261256 0.695601
C  -2.971641 2.827118 1.15693
C  -1.609683 2.596364 1.00775
C  -3.419321 4.104895 1.468205
C  -0.71359 3.646925 1.138174
C  -2.512168 5.141036 1.630254
C  -1.155802 4.92347 1.452825
C  2.631777 -2.363674 1.03793
C  1.136568 2.750118 -0.035893
C  0.514572 2.680959 -1.278238
C  2.357349 2.119366 0.169298
C  1.120359 1.970091 -2.303897
C  2.955397 1.423214 -0.868969
C  2.337328 1.334874 -2.107842
H  -5.243434 -0.088185 -0.600754
H  -4.386697 -0.840152 0.754369
H  -2.777139 -1.180643 -3.225306
H  -4.293304 -0.317447 -2.970763
H  -2.784269 0.401625 -2.447673
H  -3.903775 -3.214115 -2.01735
H  -5.315754 -2.166618 -1.928415
H  -4.715828 -2.941636 -0.475628
H  -1.084418 0.085956 -1.277541
H  -2.862353 -3.452733 0.357027
H  -4.948622 2.085538 0.794275
H  -4.01646 1.133158 1.949129
H  0.985154 -0.419674 -0.189419
H  -0.744308 -4.000795 1.427927
H  -1.250041 1.600328 0.783033
H  -4.479792 4.295368 1.578463
H  -2.865428 6.134003 1.87422
H  -0.44187 5.729819 1.555044
H  -0.430254 3.178777 -1.451856
H  2.831827 2.182252 1.139454
H  0.631816 1.919744 -3.268244
H  3.904303 0.932051 -0.702236
H  2.800018 0.777742 -2.910611
totalener: -3928.09206203 hartree
nucrepener: 3590.48826424 hartree
electener: -7518.58032627 hartree
twoeener: 5058.52804131 hartree
kineticenergy: 3918.82693816 hartree
xcener: -198.390873390215 hartree
chargesum: 0.0000000
charge: -0.082778 -0.140038 -0.150289 -0.311509 -0.244427 -0.297499 0.274555 -0.060047 0.043306 -0.325981 -0.316597 -0.271513 -0.190841 0.058869 0.013560 -0.139438 0.127732 -0.003954 -0.157179 -0.176076 0.223595 -0.094595 -0.200883 0.420098 0.263559 -0.184206 -0.182835 -0.136643 -0.118511 -0.127258 0.086417 0.086360 0.109761 0.087790 0.097969 0.117368 0.094916 0.085002 0.121567 0.119316 0.069226 0.085182 0.073968 0.124760 0.138482 0.106016 0.123437 0.124815 0.134311 0.124406 0.127163 0.126358 0.123233
qa: -0.0828 -0.1400 -0.1503 -0.3115 -0.2444 -0.2975 0.2746 -0.0600 0.0433 -0.3260 -0.3166 -0.2715 -0.1908 0.0589 0.0136 -0.1394 0.1277 -0.0040 -0.1572 -0.1761 0.2236 -0.0946 -0.2009 0.4201 0.2636 -0.1842 -0.1828 -0.1366 -0.1185 -0.1273 0.0864 0.0864 0.1098 0.0878 0.0980 0.1174 0.0949 0.0850 0.1216 0.1193 0.0692 0.0852 0.0740 0.1248 0.1385 0.1060 0.1234 0.1248 0.1343 0.1244 0.1272 0.1264 0.1232
va: 1.1721 1.1594 1.1303 2.0011 2.1482 2.1198 3.7215 3.9812 3.6554 3.9311 3.9096 4.1354 4.0420 3.9287 3.8402 4.0539 3.9381 3.8309 3.9126 3.9927 3.8236 3.9557 4.0377 4.5771 3.7966 3.8660 3.9432 3.9157 3.8942 3.8864 0.9967 0.9977 1.0022 1.0079 1.0140 1.0020 1.0096 1.0051 1.0068 1.0035 0.9923 0.9873 1.0365 1.0130 1.0088 1.0128 1.0001 1.0129 1.0055 1.0164 1.0009 1.0073 1.0025
dispcorr: -0.032819048 hartree
energy: -3928.124881077830
dipole: -76.87671 75.26434 -1.61237 42.00075 -41.95194 0.04881 -5.76863 5.38301 -0.38562
magnitude: 1.65856 au
magnitude: 4.21574 debye
