program: Orca
programVersion: 5.0.2
elementType: Br F F O O O C C C C C C C C C C C C C C C C C C C C C C C C H H H H H H H H H H H H H H H H H H H H H H H
charge: 0
multiplicity: 1
keywords: wb97x-d3
keywords: def2-TZVPP
keywords: def2/J RIJCOSX
keywords: DEFGRID2
keywords: scfconv7
keywords: smallprint printgap noloewdin
keywords: NOSOSCF
formula: C24H23BrF2O3
InChI: InChI=1/C24H23BrF2O3/c1-23(2,19-11-13-21(14-12-19)30-24(25,26)27)17-28-16-18-7-6-10-22(15-18)29-20-8-4-3-5-9-20/h3-15H,16-17H2,1-2H3
53 atoms
Br 1.646326 -0.471316 1.940813
F  3.603911 -2.199116 1.288786
F  1.845901 -3.132387 2.097127
O  -3.261532 0.508463 -0.431942
O  1.918798 -2.422827 -0.011998
O  1.248372 2.549259 0.429121
C  -3.398641 -1.433958 -1.803256
C  -4.030965 -0.636008 -0.655722
C  -1.968225 -1.757603 -1.38854
C  -3.464323 -0.608564 -3.089705
C  -4.218142 -2.710675 -2.017624
C  -1.727024 -2.663512 -0.356995
C  -0.86618 -1.11771 -1.945462
C  -3.455753 1.140999 0.797373
C  -0.452083 -2.910196 0.12321
C  0.418627 -1.340803 -1.4746
C  0.615375 -2.224857 -0.431995
C  -2.343067 2.125259 1.037145
C  -1.058871 1.863105 0.57266
C  -2.586709 3.28118 1.768892
C  -0.039808 2.771776 0.825684
C  -1.555052 4.165913 2.040035
C  -0.278171 3.923499 1.56141
C  2.27869 -2.182284 1.253128
C  1.547759 2.140373 -0.832402
C  0.734924 2.385398 -1.933397
C  2.769202 1.495948 -0.996798
C  1.150093 1.972256 -3.191395
C  3.17254 1.096687 -2.259697
C  2.364036 1.325095 -3.365398
H  -5.070533 -0.376657 -0.911261
H  -4.072369 -1.263909 0.247681
H  -2.999249 -1.138172 -3.922616
H  -4.506093 -0.427129 -3.359208
H  -2.983998 0.363562 -2.991164
H  -4.2890 -3.327138 -1.121268
H  -3.777296 -3.323338 -2.804094
H  -5.23748 -2.464798 -2.320869
H  -2.54905 -3.195252 0.104656
H  -0.98887 -0.405004 -2.747949
H  -4.424848 1.659648 0.838423
H  -3.464027 0.401531 1.613142
H  -0.307761 -3.629106 0.916647
H  1.258736 -0.814078 -1.907642
H  -0.856319 0.95719 0.015099
H  -3.586832 3.493572 2.126899
H  -1.748915 5.062721 2.613369
H  0.531565 4.614792 1.753504
H  -0.21118 2.897474 -1.820025
H  3.396039 1.315175 -0.134167
H  0.515372 2.171752 -4.045157
H  4.124074 0.594887 -2.376625
H  2.680263 1.008947 -4.350083
totalener: -3928.09268473 hartree
nucrepener: 3752.26446415 hartree
electener: -7680.35714888 hartree
twoeener: 5220.62390239 hartree
kineticenergy: 3918.82847314 hartree
xcener: -198.395188878863 hartree
chargesum: 0.0000000
charge: -0.072217 -0.145571 -0.160993 -0.311276 -0.254700 -0.295316 0.301636 -0.069541 0.010451 -0.345566 -0.298398 -0.185454 -0.178253 0.055396 -0.098698 -0.082245 0.060630 -0.004143 -0.119564 -0.166405 0.227074 -0.100443 -0.208420 0.438677 0.334110 -0.192054 -0.263049 -0.149714 -0.074803 -0.155497 0.090281 0.081730 0.108602 0.090664 0.099672 0.088986 0.107778 0.093655 0.109875 0.116124 0.072480 0.082412 0.128665 0.142313 0.099763 0.104855 0.123058 0.125585 0.130555 0.127686 0.129229 0.127579 0.122799
qa: -0.0722 -0.1456 -0.1610 -0.3113 -0.2547 -0.2953 0.3016 -0.0695 0.0105 -0.3456 -0.2984 -0.1855 -0.1783 0.0554 -0.0987 -0.0822 0.0606 -0.0041 -0.1196 -0.1664 0.2271 -0.1004 -0.2084 0.4387 0.3341 -0.1921 -0.2630 -0.1497 -0.0748 -0.1555 0.0903 0.0817 0.1086 0.0907 0.0997 0.0890 0.1078 0.0937 0.1099 0.1161 0.0725 0.0824 0.1287 0.1423 0.0998 0.1049 0.1231 0.1256 0.1306 0.1277 0.1292 0.1276 0.1228
va: 1.1914 1.1547 1.1292 1.9934 2.1220 2.0933 3.7278 3.9806 3.6654 3.9222 3.9177 4.0507 3.9610 3.9327 4.0407 3.8854 4.0094 3.8361 3.8631 3.9787 3.7417 3.9688 4.0651 4.5345 3.7041 3.9058 3.9790 3.8995 3.9099 3.9275 1.0012 0.9965 1.0010 1.0105 1.0126 1.0071 1.0044 1.0068 1.0116 1.0114 0.9909 0.9877 1.0192 0.9995 1.0302 1.0135 1.0002 1.0133 1.0075 1.0216 1.0000 0.9995 1.0021
dispcorr: -0.035205060 hartree
energy: -3928.127889792555
dipole: -56.47223 54.90619 -1.56604 13.31524 -13.24304 0.07220 -44.33157 43.83806 -0.49351
magnitude: 1.64355 au
magnitude: 4.17757 debye
