program: Orca
programVersion: 5.0.2
elementType: Cl F F F O O O N N C C C C C C C C C C C C C C C C C C C C C C C C C C H H H H H H H H H H H H H H H H H H H H H H
charge: 0
multiplicity: 1
keywords: wb97x-d3
keywords: def2-TZVPP
keywords: def2/J RIJCOSX
keywords: DEFGRID2
keywords: scfconv7
keywords: smallprint printgap noloewdin
keywords: NOSOSCF
formula: C26H22ClF3N2O3
InChI: InChI=1/C26H22ClF3N2O3/c1-16(2)24(32-22-12-11-18(14-21(22)27)26(28,29)30)25(33)35-23(15-31)17-7-6-10-20(13-17)34-19-8-4-3-5-9-19/h3-14,16,23-24,32H,1-2H3
57 atoms
Cl 1.598587 4.012342 -1.493838
F  -3.832754 3.656633 -0.775372
F  -3.383976 2.411822 -2.46238
F  -4.121175 1.5284 -0.643033
O  2.465194 -0.226273 -0.582013
O  2.136065 -1.425755 1.277262
O  -2.304982 -3.084625 -0.076169
N  2.045876 2.074014 0.724425
N  3.311307 -3.553033 -0.939633
C  3.983168 1.122964 1.934275
C  2.519746 0.947239 1.480948
C  4.990805 1.187957 0.791549
C  4.108599 2.342689 2.839204
C  2.346276 -0.370818 0.738839
C  0.758318 2.130913 0.272622
C  2.097761 -1.296546 -1.449395
C  0.385781 3.013108 -0.757741
C  -0.264656 1.346295 0.823826
C  0.596732 -1.404744 -1.55158
C  -1.905913 2.322534 -0.63633
C  -0.912104 3.109773 -1.207359
C  -1.569752 1.442192 0.38067
C  -0.135025 -2.27885 -0.759946
C  -0.048633 -0.533007 -2.422396
C  -3.304762 2.470749 -1.12342
C  -1.522644 -2.247675 -0.822574
C  2.765859 -2.554238 -1.1072
C  -1.431644 -0.539515 -2.497459
C  -2.176302 -1.384289 -1.689474
C  -1.902202 -3.456997 1.184492
C  -1.39239 -2.538446 2.094511
C  -2.081153 -4.785676 1.537934
C  -1.051155 -2.970226 3.367856
C  -1.747689 -5.199846 2.819926
C  -1.225915 -4.298012 3.736603
H  4.207025 0.23583 2.532738
H  1.929003 0.847175 2.395265
H  4.822841 2.043242 0.133769
H  4.996858 0.286546 0.179082
H  5.994351 1.300326 1.202572
H  5.105457 2.378578 3.279185
H  3.385857 2.314046 3.655607
H  3.960602 3.27293 2.289576
H  2.735363 2.532389 0.147509
H  2.500801 -0.999798 -2.419816
H  -0.053111 0.652302 1.625543
H  -1.141793 3.802133 -2.007293
H  -2.314484 0.811418 0.8464
H  0.364076 -2.979097 -0.102509
H  0.527448 0.143235 -3.041208
H  -1.936706 0.130753 -3.178707
H  -3.257799 -1.380512 -1.732747
H  -1.264159 -1.497315 1.822997
H  -2.482707 -5.487022 0.817707
H  -0.652488 -2.257739 4.077838
H  -1.890739 -6.236109 3.096357
H  -0.96007 -4.625565 4.732591
elementType: Cl F O N C H
totalener: -2099.11640707 hartree
nucrepener: 4100.84151640 hartree
electener: -6199.95792347 hartree
twoeener: 4835.65751492 hartree
cpcmener: -0.04543228 hartree
kineticenergy: 2091.80097176 hartree
xcener: -173.918990660894 hartree
chargesum: -0.0000000
charge: -0.097198 -0.188606 -0.190149 -0.185364 -0.260091 -0.435231 -0.337442 -0.251568 -0.093227 0.062086 0.145858 -0.298761 -0.298692 0.328213 0.167267 0.411587 -0.002771 -0.201571 0.028585 -0.079874 -0.126118 -0.172317 -0.182021 -0.275383 0.573067 0.280145 -0.230241 -0.074613 -0.255529 0.263563 -0.159453 -0.222760 -0.189633 -0.142532 -0.162009 0.061056 0.131148 0.084947 0.090792 0.102079 0.100348 0.096700 0.083634 0.161993 0.144567 0.147988 0.123369 0.152741 0.141209 0.144790 0.153653 0.144405 0.157773 0.147696 0.159451 0.161235 0.161210
qa: -0.0972 -0.1886 -0.1901 -0.1854 -0.2601 -0.4352 -0.3374 -0.2516 -0.0932 0.0621 0.1459 -0.2988 -0.2987 0.3282 0.1673 0.4116 -0.0028 -0.2016 0.0286 -0.0799 -0.1261 -0.1723 -0.1820 -0.2754 0.5731 0.2801 -0.2302 -0.0746 -0.2555 0.2636 -0.1595 -0.2228 -0.1896 -0.1425 -0.1620 0.0611 0.1311 0.0849 0.0908 0.1021 0.1003 0.0967 0.0836 0.1620 0.1446 0.1480 0.1234 0.1527 0.1412 0.1448 0.1537 0.1444 0.1578 0.1477 0.1595 0.1612 0.1612
va: 1.2296 1.1021 1.1011 1.1150 2.1546 2.0612 2.0775 3.2197 3.1026 3.8137 3.8397 3.9530 3.9348 4.1431 3.8412 3.8956 3.8842 3.8739 3.5685 3.6012 4.0877 3.9312 3.9105 3.9617 4.3979 3.7480 4.0636 3.8013 3.9812 3.6861 3.8474 3.9874 3.9353 3.8911 3.8772 1.0242 1.0063 1.0035 1.0156 1.0027 1.0036 1.0038 1.0105 1.0365 0.9955 1.0100 1.0275 1.0054 1.0209 1.0025 1.0032 1.0117 0.9850 1.0071 0.9920 0.9882 0.9888
dispcorr: -0.039648140 hartree
energy: -2099.156055210359
dipole: 31.46522 -30.37627 1.08895 -17.32195 19.03931 1.71736 24.81672 -24.49515 0.32157
magnitude: 2.05878 au
magnitude: 5.23299 debye
