program: Orca
programVersion: 5.0.2
elementType: Cl F F F O O O N N C C C C C C C C C C C C C C C C C C C C C C C C C C H H H H H H H H H H H H H H H H H H H H H H
charge: 0
multiplicity: 1
keywords: wb97x-d3
keywords: def2-TZVPP
keywords: def2/J RIJCOSX
keywords: DEFGRID2
keywords: scfconv7
keywords: smallprint printgap noloewdin
keywords: NOSOSCF
formula: C26H22ClF3N2O3
InChI: InChI=1/C26H22ClF3N2O3/c1-16(2)24(32-22-12-11-18(14-21(22)27)26(28,29)30)25(33)35-23(15-31)17-7-6-10-20(13-17)34-19-8-4-3-5-9-19/h3-14,16,23-24,32H,1-2H3
57 atoms
Cl 0.352673 3.010975 -2.15939
F  -3.400736 0.039643 1.484044
F  -3.411112 1.926287 2.494556
F  -3.97524 1.821572 0.420774
O  3.122193 -0.180073 -0.517369
O  3.740414 -0.405362 1.61718
O  -1.948444 -1.220405 -1.119442
N  2.311998 2.354944 -0.019617
N  4.683048 -3.19619 0.167223
C  4.757158 2.431314 0.241166
C  3.424247 1.817257 0.719705
C  5.896444 2.067762 1.185611
C  5.132322 2.094737 -1.198279
C  3.454522 0.297173 0.683327
C  1.017666 2.045413 0.28631
C  2.816181 -1.563822 -0.656099
C  -0.027705 2.33195 -0.607905
C  0.646393 1.474282 1.514266
C  1.457369 -1.862529 -0.07275
C  -1.691227 1.568981 0.937258
C  -1.353034 2.104931 -0.296991
C  -0.676805 1.243901 1.830814
C  0.356695 -1.480211 -0.831913
C  1.278387 -2.437403 1.177235
C  -3.112604 1.341813 1.323753
C  -0.922773 -1.66711 -0.335851
C  3.874001 -2.441166 -0.147001
C  -0.00991 -2.617409 1.662128
C  -1.114331 -2.230397 0.921353
C  -3.131203 -1.905812 -1.211628
C  -4.261201 -1.145511 -1.483444
C  -3.217275 -3.288705 -1.111576
C  -5.486654 -1.773812 -1.643064
C  -4.454173 -3.901947 -1.26132
C  -5.592609 -3.153194 -1.523989
H  4.597583 3.511251 0.309869
H  3.322028 2.089233 1.773116
H  6.788848 2.636404 0.923931
H  6.160315 1.01072 1.124589
H  5.651643 2.296562 2.223416
H  5.412716 1.046784 -1.312456
H  5.995894 2.691658 -1.492576
H  4.343228 2.311424 -1.920216
H  2.497583 2.573901 -0.986639
H  2.789728 -1.724469 -1.735976
H  1.394662 1.224638 2.253258
H  -2.109009 2.358478 -1.027429
H  -0.905229 0.811317 2.796488
H  0.492764 -1.03793 -1.811939
H  2.122501 -2.753737 1.775205
H  -0.156971 -3.060446 2.637754
H  -2.107183 -2.377959 1.323492
H  -4.178223 -0.070748 -1.577721
H  -2.339961 -3.893224 -0.921815
H  -6.363933 -1.176714 -1.854464
H  -4.520528 -4.978578 -1.175893
H  -6.55194 -3.639492 -1.638638
elementType: Cl F O N C H
totalener: -2099.11640894 hartree
nucrepener: 4111.54654036 hartree
electener: -6210.66294930 hartree
twoeener: 4847.12967086 hartree
cpcmener: -0.04347163 hartree
kineticenergy: 2091.78785049 hartree
xcener: -173.916651295540 hartree
chargesum: 0.0000000
charge: -0.098561 -0.183527 -0.187553 -0.186917 -0.262126 -0.426692 -0.329935 -0.236282 -0.093572 0.054827 0.148594 -0.315379 -0.292204 0.311455 0.165073 0.420916 -0.003941 -0.183736 0.046437 -0.058234 -0.110876 -0.231499 -0.348147 -0.169237 0.580270 0.372270 -0.233234 -0.140174 -0.233204 0.337803 -0.287096 -0.221190 -0.114739 -0.150713 -0.195280 0.063278 0.135167 0.101094 0.086331 0.102166 0.085209 0.103945 0.091175 0.160890 0.142165 0.139463 0.127501 0.148963 0.128782 0.139605 0.163071 0.152039 0.144741 0.157928 0.160679 0.161803 0.160407
qa: -0.0986 -0.1835 -0.1876 -0.1869 -0.2621 -0.4267 -0.3299 -0.2363 -0.0936 0.0548 0.1486 -0.3154 -0.2922 0.3115 0.1651 0.4209 -0.0039 -0.1837 0.0464 -0.0582 -0.1109 -0.2315 -0.3481 -0.1692 0.5803 0.3723 -0.2332 -0.1402 -0.2332 0.3378 -0.2871 -0.2212 -0.1147 -0.1507 -0.1953 0.0633 0.1352 0.1011 0.0863 0.1022 0.0852 0.1039 0.0912 0.1609 0.1422 0.1395 0.1275 0.1490 0.1288 0.1396 0.1631 0.1520 0.1447 0.1579 0.1607 0.1618 0.1604
va: 1.2301 1.0955 1.1083 1.1124 2.1534 2.0708 2.0211 3.2217 3.1044 3.8587 3.8651 3.9391 3.9477 4.1257 3.8462 3.8921 3.8810 3.8396 3.5737 3.5677 3.9671 4.0525 4.1103 3.9255 4.3785 3.4810 4.0496 3.9521 3.9331 3.6341 3.9842 3.9131 3.8891 3.8927 3.9114 1.0188 1.0045 1.0015 1.0072 1.0041 1.0100 1.0030 1.0100 1.0410 0.9962 1.0171 1.0246 1.0100 1.0236 1.0195 0.9896 1.0085 1.0170 0.9980 0.9892 0.9895 0.9896
dispcorr: -0.039649000 hartree
energy: -2099.156057936724
dipole: 30.73979 -30.69182 0.04797 -8.05191 9.07482 1.02290 -1.79127 0.88523 -0.90604
magnitude: 1.36731 au
magnitude: 3.47543 debye
