program: Orca
programVersion: 5.0.2
elementType: Cl F F F O O O N N C C C C C C C C C C C C C C C C C C C C C C C C C C H H H H H H H H H H H H H H H H H H H H H H
charge: 0
multiplicity: 1
keywords: wb97x-d3
keywords: def2-TZVPP
keywords: def2/J RIJCOSX
keywords: DEFGRID2
keywords: scfconv7
keywords: smallprint printgap noloewdin
keywords: NOSOSCF
formula: C26H22ClF3N2O3
InChI: InChI=1/C26H22ClF3N2O3/c1-16(2)24(32-22-12-11-18(14-21(22)27)26(28,29)30)25(33)35-23(15-31)17-7-6-10-20(13-17)34-19-8-4-3-5-9-19/h3-14,16,23-24,32H,1-2H3
57 atoms
Cl -0.587885 3.640488 -1.660227
F  -3.042494 0.104011 2.935515
F  -3.894016 1.997736 2.367278
F  -3.899746 0.362574 0.979282
O  3.267048 -0.710127 0.186181
O  1.871386 -0.094074 -1.448946
O  -1.95478 -2.923271 -0.030442
N  1.824293 2.468637 -0.341175
N  4.831524 -3.506028 0.982731
C  4.182755 2.1766 -0.958332
C  2.981649 1.623923 -0.165009
C  5.477941 1.476847 -0.564785
C  3.997761 2.144057 -2.471903
C  2.63872 0.194936 -0.569896
C  0.62995 2.129348 0.23726
C  2.870688 -2.075704 0.019922
C  -0.592968 2.605197 -0.266955
C  0.562495 1.313593 1.373097
C  1.572957 -2.333548 0.74614
C  -1.838311 1.403096 1.389826
C  -1.802792 2.247473 0.28545
C  -0.646333 0.954074 1.936109
C  0.425234 -2.565933 0.00486
C  1.513001 -2.257006 2.134738
C  -3.158676 0.968886 1.920806
C  -0.793716 -2.687538 0.65911
C  3.971683 -2.865711 0.567047
C  0.295724 -2.421005 2.77407
C  -0.86608 -2.621682 2.040737
C  -2.302924 -2.13142 -1.096814
C  -3.263357 -2.654759 -1.954082
C  -1.781634 -0.861816 -1.313479
C  -3.700944 -1.9022 -3.03309
C  -2.225348 -0.124762 -2.403072
C  -3.18207 -0.635419 -3.267672
H  4.259618 3.221136 -0.642638
H  3.274102 1.623646 0.887119
H  5.515418 0.447547 -0.924774
H  5.619191 1.464953 0.516703
H  6.327544 2.001541 -1.002134
H  4.000049 1.124247 -2.859925
H  4.824733 2.671607 -2.947741
H  3.081655 2.629958 -2.811557
H  1.747361 2.877882 -1.260782
H  2.77846 -2.336086 -1.038444
H  1.467811 0.948192 1.837629
H  -2.716295 2.617194 -0.16294
H  -0.634237 0.3132 2.805794
H  0.479957 -2.638784 -1.074154
H  2.406976 -2.072109 2.717851
H  0.242312 -2.370056 3.853137
H  -1.820766 -2.73026 2.539206
H  -3.668872 -3.641993 -1.772108
H  -1.042691 -0.434141 -0.649746
H  -4.450469 -2.31465 -3.695479
H  -1.816273 0.863451 -2.569417
H  -3.521066 -0.052434 -4.113283
elementType: Cl F O N C H
totalener: -2099.11806906 hartree
nucrepener: 4167.78480112 hartree
electener: -6266.90287018 hartree
twoeener: 4902.85379549 hartree
cpcmener: -0.04241062 hartree
kineticenergy: 2091.79394105 hartree
xcener: -173.915587949242 hartree
chargesum: 0.0000000
charge: -0.102072 -0.185404 -0.187496 -0.187575 -0.260983 -0.439006 -0.338740 -0.250463 -0.097235 0.049352 0.170071 -0.314343 -0.294997 0.296894 0.160079 0.413640 0.038291 -0.160821 0.037369 -0.008364 -0.224899 -0.223453 -0.212318 -0.235748 0.569073 0.322796 -0.221106 -0.123882 -0.238766 0.321454 -0.262350 -0.156857 -0.122051 -0.160383 -0.203037 0.063093 0.124072 0.084457 0.100880 0.100862 0.086890 0.103894 0.091831 0.159574 0.141624 0.155167 0.126750 0.166283 0.149533 0.145484 0.163823 0.146407 0.145930 0.096487 0.160504 0.160196 0.159588
qa: -0.1021 -0.1854 -0.1875 -0.1876 -0.2610 -0.4390 -0.3387 -0.2505 -0.0972 0.0494 0.1701 -0.3143 -0.2950 0.2969 0.1601 0.4136 0.0383 -0.1608 0.0374 -0.0084 -0.2249 -0.2235 -0.2123 -0.2357 0.5691 0.3228 -0.2211 -0.1239 -0.2388 0.3215 -0.2623 -0.1569 -0.1221 -0.1604 -0.2030 0.0631 0.1241 0.0845 0.1009 0.1009 0.0869 0.1039 0.0918 0.1596 0.1416 0.1552 0.1267 0.1663 0.1495 0.1455 0.1638 0.1464 0.1459 0.0965 0.1605 0.1602 0.1596
va: 1.2187 1.1138 1.1070 1.0990 2.1628 2.0508 2.0770 3.2238 3.1097 3.8464 3.8479 3.9483 3.9407 4.1457 3.8895 3.7418 3.8250 3.8633 3.5424 3.5151 4.0911 3.9754 3.9464 3.9352 4.4024 3.6283 4.0706 3.8396 3.9685 3.6853 3.9818 3.8086 3.8860 3.8880 3.9380 1.0187 1.0115 1.0082 1.0044 1.0022 1.0085 1.0025 1.0104 1.0416 1.0169 1.0046 1.0288 1.0015 1.0103 1.0095 0.9874 1.0105 1.0093 1.0135 0.9872 0.9939 0.9902
dispcorr: -0.041425428 hartree
energy: -2099.159494489226
dipole: 35.51757 -34.17825 1.33933 -3.24595 4.57098 1.32503 -15.62554 15.31587 -0.30967
magnitude: 1.90929 au
magnitude: 4.85303 debye
