program: Orca
programVersion: 5.0.2
elementType: Cl F F F O O O N N C C C C C C C C C C C C C C C C C C C C C C C C C C H H H H H H H H H H H H H H H H H H H H H H
charge: 0
multiplicity: 1
keywords: wb97x-d3
keywords: def2-TZVPP
keywords: def2/J RIJCOSX
keywords: DEFGRID2
keywords: scfconv7
keywords: smallprint printgap noloewdin
keywords: NOSOSCF
formula: C26H22ClF3N2O3
InChI: InChI=1/C26H22ClF3N2O3/c1-16(2)24(32-22-12-11-18(14-21(22)27)26(28,29)30)25(33)35-23(15-31)17-7-6-10-20(13-17)34-19-8-4-3-5-9-19/h3-14,16,23-24,32H,1-2H3
57 atoms
Cl -0.577814 1.435139 -2.301263
F  -2.894125 0.363626 2.956163
F  -2.988473 2.477578 3.318407
F  -4.011533 1.63248 1.627882
O  2.586332 -0.320681 0.015041
O  3.779301 0.515272 1.706299
O  -1.303369 -2.686699 -2.294803
N  1.851315 2.150611 -0.730722
N  0.974341 -1.262578 2.83616
C  4.242429 2.014804 -1.226794
C  3.155093 1.968045 -0.136375
C  4.211576 3.361424 -1.941278
C  5.628662 1.757487 -0.646886
C  3.230147 0.664073 0.646867
C  0.709987 2.017551 0.012143
C  2.436623 -1.565288 0.684777
C  -0.518218 1.690934 -0.585546
C  0.697521 2.222658 1.39898
C  1.738412 -2.504113 -0.263217
C  -1.660277 1.753241 1.519012
C  -1.681199 1.554597 0.144674
C  -0.460877 2.087036 2.136292
C  0.507746 -2.138298 -0.79769
C  2.337564 -3.705496 -0.60813
C  -2.885979 1.561386 2.344938
C  -0.123393 -2.99955 -1.680661
C  1.630301 -1.376179 1.898028
C  1.693593 -4.554631 -1.498318
C  0.463759 -4.210028 -2.032363
C  -2.309772 -2.038881 -1.621866
C  -3.102053 -1.183421 -2.374131
C  -2.59177 -2.274189 -0.28185
C  -4.198199 -0.572533 -1.783317
C  -3.682797 -1.642534 0.299243
C  -4.494755 -0.79853 -0.446199
H  4.018574 1.227025 -1.95473
H  3.363078 2.76914 0.578273
H  3.261278 3.551842 -2.438574
H  4.989495 3.39375 -2.704635
H  4.396936 4.179391 -1.242208
H  5.748039 0.74577 -0.257875
H  5.86076 2.460264 0.1555
H  6.38089 1.886403 -1.425373
H  1.787482 1.800625 -1.676515
H  3.404846 -1.976173 0.983952
H  1.603587 2.507023 1.916183
H  -2.594311 1.291462 -0.372769
H  -0.411596 2.253257 3.204534
H  0.049739 -1.194536 -0.523338
H  3.298449 -3.975213 -0.189618
H  2.151572 -5.494594 -1.775122
H  -0.040687 -4.87161 -2.724991
H  -2.866428 -1.006896 -3.415749
H  -1.983192 -2.947146 0.30889
H  -4.817543 0.089921 -2.37378
H  -3.904612 -1.830217 1.341165
H  -5.350643 -0.320699 0.009853
elementType: Cl F O N C H
totalener: -2099.11919943 hartree
nucrepener: 4148.85412734 hartree
electener: -6247.97332677 hartree
twoeener: 4884.94319963 hartree
cpcmener: -0.04317470 hartree
kineticenergy: 2091.78780758 hartree
xcener: -173.912404047918 hartree
chargesum: 0.0000000
charge: -0.097748 -0.188194 -0.186737 -0.183508 -0.261414 -0.423260 -0.332169 -0.231172 -0.093913 0.058620 0.116667 -0.295062 -0.303224 0.326506 0.149928 0.435764 0.002244 -0.209525 -0.006565 -0.063411 -0.120479 -0.199621 -0.194011 -0.197029 0.564456 0.273941 -0.239831 -0.109070 -0.241275 0.327772 -0.296684 -0.181382 -0.090876 -0.160616 -0.193116 0.062466 0.123172 0.092707 0.096690 0.090350 0.094117 0.096281 0.095278 0.153520 0.135673 0.150414 0.161039 0.148033 0.117785 0.150216 0.162856 0.149662 0.143747 0.153703 0.157757 0.156012 0.152515
qa: -0.0977 -0.1882 -0.1867 -0.1835 -0.2614 -0.4233 -0.3322 -0.2312 -0.0939 0.0586 0.1167 -0.2951 -0.3032 0.3265 0.1499 0.4358 0.0022 -0.2095 -0.0066 -0.0634 -0.1205 -0.1996 -0.1940 -0.1970 0.5645 0.2739 -0.2398 -0.1091 -0.2413 0.3278 -0.2967 -0.1814 -0.0909 -0.1606 -0.1931 0.0625 0.1232 0.0927 0.0967 0.0903 0.0941 0.0963 0.0953 0.1535 0.1357 0.1504 0.1610 0.1480 0.1178 0.1502 0.1629 0.1497 0.1437 0.1537 0.1578 0.1560 0.1525
va: 1.2304 1.0942 1.1125 1.1149 2.1858 2.0702 2.0790 3.1981 3.0943 3.8187 3.8513 3.9381 3.9458 4.1419 3.8579 3.7325 3.9059 3.9037 3.7446 3.6666 3.9151 4.0255 3.9542 3.9349 4.4124 3.7337 4.0221 3.8864 4.0062 3.6101 3.9612 3.8700 3.8176 3.8285 3.8441 1.0257 1.0058 1.0159 1.0048 1.0011 1.0085 1.0042 1.0033 1.0434 1.0154 1.0108 1.0043 1.0094 1.0287 1.0009 0.9880 1.0051 1.0131 0.9988 0.9886 1.0002 0.9990
dispcorr: -0.039859127 hartree
energy: -2099.159058554286
dipole: 36.61224 -34.20479 2.40745 -2.04247 1.75441 -0.28806 -17.64260 15.13621 -2.50639
magnitude: 3.48723 au
magnitude: 8.86383 debye
