program: Orca
programVersion: 5.0.2
elementType: Cl F F F O O O N N C C C C C C C C C C C C C C C C C C C C C C C C C C H H H H H H H H H H H H H H H H H H H H H H
charge: 0
multiplicity: 1
keywords: wb97x-d3
keywords: def2-TZVPP
keywords: def2/J RIJCOSX
keywords: DEFGRID2
keywords: scfconv7
keywords: smallprint printgap noloewdin
keywords: NOSOSCF
formula: C26H22ClF3N2O3
InChI: InChI=1/C26H22ClF3N2O3/c1-16(2)24(32-22-12-11-18(14-21(22)27)26(28,29)30)25(33)35-23(15-31)17-7-6-10-20(13-17)34-19-8-4-3-5-9-19/h3-14,16,23-24,32H,1-2H3
57 atoms
Cl -0.423244 1.801356 -2.255434
F  -2.627742 -0.298368 2.800819
F  -2.937488 1.742208 3.379826
F  -3.838629 0.989608 1.575249
O  2.768994 -0.272866 0.0664
O  4.368164 0.425212 1.454928
O  -2.020773 -2.002532 0.121387
N  2.000915 2.170059 -0.574978
N  2.528608 -1.642057 3.215189
C  4.363424 2.361275 -1.118204
C  3.323492 2.033367 -0.021938
C  4.182376 3.804459 -1.580401
C  5.800759 2.139465 -0.660909
C  3.56794 0.656545 0.589051
C  0.862906 1.921538 0.131295
C  2.778088 -1.586315 0.611424
C  -0.365011 1.71654 -0.521506
C  0.843829 1.86081 1.533252
C  1.587589 -2.300711 0.023886
C  -1.509848 1.346795 1.550321
C  -1.527366 1.430209 0.164424
C  -0.314918 1.572737 2.225109
C  0.311074 -1.826105 0.30862
C  1.762482 -3.390325 -0.813248
C  -2.72638 0.95154 2.316454
C  -0.787561 -2.457103 -0.244642
C  2.662465 -1.571584 2.07661
C  0.648232 -4.013776 -1.363038
C  -0.628162 -3.556831 -1.082803
C  -2.968529 -1.726729 -0.823519
C  -2.651864 -1.292879 -2.105296
C  -4.293585 -1.839231 -0.420494
C  -3.679512 -0.982355 -2.986504
C  -5.3075 -1.519433 -1.310814
C  -5.007723 -1.094343 -2.598897
H  4.167343 1.692651 -1.964976
H  3.470955 2.747879 0.795361
H  4.349292 4.500486 -0.75502
H  3.190039 3.999058 -1.986947
H  4.905083 4.039589 -2.363134
H  6.023396 2.69101 0.254804
H  6.484224 2.497659 -1.431856
H  6.039364 1.089989 -0.492587
H  1.943541 2.009476 -1.569811
H  3.708666 -2.101515 0.354773
H  1.748048 2.040456 2.100092
H  -2.438084 1.271428 -0.397256
H  -0.269471 1.52289 3.305709
H  0.161478 -0.978067 0.96775
H  2.757353 -3.75432 -1.036338
H  0.77671 -4.869625 -2.012325
H  -1.491121 -4.056249 -1.505369
H  -1.621935 -1.183679 -2.421094
H  -4.524254 -2.172095 0.584152
H  -3.431894 -0.644234 -3.984964
H  -6.33889 -1.609782 -0.993534
H  -5.80166 -0.850496 -3.29273
elementType: Cl F O N C H
totalener: -2099.13039641 hartree
nucrepener: 4133.73796014 hartree
electener: -6232.86835655 hartree
twoeener: 4869.50507688 hartree
cpcmener: -0.03984339 hartree
kineticenergy: 2091.76828500 hartree
xcener: -173.909054846206 hartree
chargesum: -0.0000000
charge: -0.100468 -0.187479 -0.186688 -0.185036 -0.253148 -0.409016 -0.319146 -0.209396 -0.076730 0.070581 0.058300 -0.288665 -0.301686 0.355035 0.188536 0.396737 0.008630 -0.238849 0.001478 -0.095780 -0.131593 -0.137562 -0.220293 -0.151346 0.569684 0.181967 -0.248869 -0.136734 -0.147430 0.335390 -0.216617 -0.288455 -0.142315 -0.099495 -0.192639 0.059427 0.124535 0.089002 0.091231 0.095338 0.095337 0.093559 0.092122 0.146253 0.137854 0.140384 0.135500 0.142880 0.135881 0.146897 0.160257 0.158410 0.140512 0.142309 0.156958 0.157273 0.157180
qa: -0.1005 -0.1875 -0.1867 -0.1850 -0.2531 -0.4090 -0.3191 -0.2094 -0.0767 0.0706 0.0583 -0.2887 -0.3017 0.3550 0.1885 0.3967 0.0086 -0.2388 0.0015 -0.0958 -0.1316 -0.1376 -0.2203 -0.1513 0.5697 0.1820 -0.2489 -0.1367 -0.1474 0.3354 -0.2166 -0.2885 -0.1423 -0.0995 -0.1926 0.0594 0.1245 0.0890 0.0912 0.0953 0.0953 0.0936 0.0921 0.1463 0.1379 0.1404 0.1355 0.1429 0.1359 0.1469 0.1603 0.1584 0.1405 0.1423 0.1570 0.1573 0.1572
va: 1.2292 1.0958 1.1119 1.1160 2.1849 2.0902 2.0431 3.1891 3.1096 3.8166 3.8864 3.9326 3.9490 4.1300 3.8431 3.7753 3.8789 3.8984 3.7131 3.6206 3.9424 4.0194 3.9944 3.9116 4.4161 3.8891 4.0422 3.9112 3.9327 3.5296 3.8650 3.9982 3.9144 3.8699 3.9182 1.0217 1.0037 1.0013 1.0190 1.0054 1.0059 1.0036 1.0091 1.0473 1.0077 1.0138 1.0105 1.0099 1.0222 1.0010 0.9903 0.9947 1.0165 1.0129 0.9909 0.9886 0.9904
dispcorr: -0.039131105 hartree
energy: -2099.169527518016
dipole: 32.15390 -30.72888 1.42502 2.45427 -2.37704 0.07723 -22.15159 18.59813 -3.55346
magnitude: 3.82932 au
magnitude: 9.73336 debye
