program: Orca
programVersion: 5.0.2
elementType: Cl F F F O O O N N C C C C C C C C C C C C C C C C C C C C C C C C C C H H H H H H H H H H H H H H H H H H H H H H
charge: 0
multiplicity: 1
keywords: wb97x-d3
keywords: def2-TZVPP
keywords: def2/J RIJCOSX
keywords: DEFGRID2
keywords: scfconv7
keywords: smallprint printgap noloewdin
keywords: NOSOSCF
formula: C26H22ClF3N2O3
InChI: InChI=1/C26H22ClF3N2O3/c1-16(2)24(32-22-12-11-18(14-21(22)27)26(28,29)30)25(33)35-23(15-31)17-7-6-10-20(13-17)34-19-8-4-3-5-9-19/h3-14,16,23-24,32H,1-2H3
57 atoms
Cl 0.262396 2.391952 -2.541244
F  -3.382438 2.247767 2.394896
F  -4.018041 2.011477 0.354423
F  -3.513578 0.287453 1.537397
O  3.315376 -0.504205 -0.474791
O  3.569144 -0.349766 1.738689
O  -1.702975 -1.345695 -1.208643
N  2.259631 2.034745 -0.373615
N  4.802583 -3.310693 0.825874
C  4.695553 2.174349 -0.254427
C  3.404384 1.679427 0.423428
C  4.693126 3.696145 -0.337465
C  5.932949 1.681179 0.4868
C  3.446147 0.177936 0.66772
C  0.968876 1.869875 0.026762
C  2.985819 -1.888052 -0.399813
C  -0.093929 2.036892 -0.879091
C  0.61516 1.559588 1.349863
C  1.57931 -2.065328 0.119769
C  -1.735874 1.660438 0.824942
C  -1.415011 1.941088 -0.495718
C  -0.705538 1.458625 1.737269
C  0.550092 -1.705874 -0.742551
C  1.293437 -2.490716 1.409181
C  -3.155069 1.554433 1.269213
C  -0.766848 -1.757541 -0.310976
C  3.99759 -2.65767 0.331333
C  -0.028068 -2.533357 1.82964
C  -1.062619 -2.157376 0.987941
C  -2.980683 -1.833056 -1.209734
C  -3.287738 -3.157931 -0.924722
C  -3.976006 -0.943719 -1.591684
C  -4.608782 -3.577384 -1.001016
C  -5.28869 -1.381216 -1.677782
C  -5.61392 -2.696045 -1.373922
H  4.717852 1.768621 -1.27215
H  3.340485 2.152758 1.407933
H  4.669013 4.143325 0.658916
H  3.842475 4.084011 -0.897708
H  5.597895 4.047153 -0.835399
H  5.919978 1.987712 1.534763
H  6.829885 2.102783 0.032027
H  6.045121 0.596126 0.454146
H  2.424085 2.085018 -1.367751
H  3.038147 -2.23082 -1.435732
H  1.379031 1.407295 2.099245
H  -2.184308 2.092994 -1.240277
H  -0.918592 1.223631 2.772445
H  0.766156 -1.379701 -1.753677
H  2.080862 -2.787056 2.089344
H  -0.25805 -2.85302 2.837351
H  -2.082033 -2.188286 1.347658
H  -2.5158 -3.864943 -0.64896
H  -3.718939 0.079264 -1.834831
H  -4.847969 -4.607893 -0.771793
H  -6.060942 -0.684844 -1.978013
H  -6.640566 -3.03257 -1.432643
elementType: Cl F O N C H
totalener: -2099.13076737 hartree
nucrepener: 4112.14366598 hartree
electener: -6211.27443335 hartree
twoeener: 4847.69454446 hartree
cpcmener: -0.03746518 hartree
kineticenergy: 2091.79166384 hartree
xcener: -173.915100972736 hartree
chargesum: 0.0000000
charge: -0.097238 -0.186626 -0.187399 -0.184068 -0.268125 -0.394783 -0.316289 -0.200968 -0.079337 0.060444 0.096019 -0.291011 -0.298823 0.325727 0.153307 0.415602 0.019730 -0.183416 0.042377 -0.029880 -0.158327 -0.233324 -0.326771 -0.173947 0.578620 0.356040 -0.240663 -0.126722 -0.249390 0.326377 -0.222381 -0.275392 -0.145955 -0.115107 -0.184110 0.060188 0.122836 0.087638 0.091665 0.097179 0.096958 0.094286 0.094986 0.150760 0.143326 0.134291 0.128428 0.144053 0.123857 0.137087 0.159851 0.151379 0.156855 0.149006 0.158237 0.155964 0.156973
qa: -0.0972 -0.1866 -0.1874 -0.1841 -0.2681 -0.3948 -0.3163 -0.2010 -0.0793 0.0604 0.0960 -0.2910 -0.2988 0.3257 0.1533 0.4156 0.0197 -0.1834 0.0424 -0.0299 -0.1583 -0.2333 -0.3268 -0.1739 0.5786 0.3560 -0.2407 -0.1267 -0.2494 0.3264 -0.2224 -0.2754 -0.1460 -0.1151 -0.1841 0.0602 0.1228 0.0876 0.0917 0.0972 0.0970 0.0943 0.0950 0.1508 0.1433 0.1343 0.1284 0.1441 0.1239 0.1371 0.1599 0.1514 0.1569 0.1490 0.1582 0.1560 0.1570
va: 1.2348 1.1110 1.1125 1.0927 2.1461 2.1032 2.0501 3.1904 3.1069 3.8176 3.8594 3.9372 3.9564 4.1101 3.8663 3.9118 3.8561 3.8398 3.5887 3.5547 3.9743 4.0702 4.0561 3.9394 4.3878 3.5545 4.0486 3.9487 3.9225 3.6524 3.9216 3.9635 3.8934 3.9029 3.9146 1.0254 1.0062 1.0015 1.0186 1.0048 1.0043 1.0030 1.0080 1.0485 0.9955 1.0230 1.0229 1.0108 1.0277 1.0193 0.9901 1.0097 0.9976 1.0074 0.9904 0.9911 0.9904
dispcorr: -0.039494816 hartree
energy: -2099.170262183980
dipole: 30.01802 -29.90679 0.11123 -3.90424 4.71947 0.81523 -0.82789 -0.40841 -1.23630
magnitude: 1.48506 au
magnitude: 3.77473 debye
