program: Orca
programVersion: 5.0.2
elementType: Cl F F F O O O N N C C C C C C C C C C C C C C C C C C C C C C C C C C H H H H H H H H H H H H H H H H H H H H H H
charge: 0
multiplicity: 1
keywords: wb97x-d3
keywords: def2-TZVPP
keywords: def2/J RIJCOSX
keywords: DEFGRID2
keywords: scfconv7
keywords: smallprint printgap noloewdin
keywords: NOSOSCF
formula: C26H22ClF3N2O3
InChI: InChI=1/C26H22ClF3N2O3/c1-16(2)24(32-22-12-11-18(14-21(22)27)26(28,29)30)25(33)35-23(15-31)17-7-6-10-20(13-17)34-19-8-4-3-5-9-19/h3-14,16,23-24,32H,1-2H3
57 atoms
Cl -0.639137 2.373954 -2.456132
F  -3.650905 3.068862 2.649243
F  -4.591418 2.203805 0.921185
F  -3.913581 0.945816 2.532238
O  2.9711 -0.681426 -0.723922
O  3.282095 -0.468651 1.476117
O  -1.664236 -2.467406 0.421794
N  1.543687 1.692185 -0.564312
N  5.485912 -2.727055 0.284417
C  3.949914 2.133776 -0.623179
C  2.775398 1.5018 0.150517
C  3.746389 3.639314 -0.74167
C  5.28317 1.825562 0.04893
C  3.034735 0.026648 0.411851
C  0.309916 1.721399 0.000377
C  3.123214 -2.085818 -0.6358
C  -0.827413 2.052493 -0.759526
C  0.092251 1.441448 1.359427
C  1.976134 -2.77222 0.079212
C  -2.2647 1.899527 1.151719
C  -2.085049 2.15146 -0.201861
C  -1.16412 1.536742 1.920124
C  0.694606 -2.254011 -0.078801
C  2.178218 -3.938418 0.802672
C  -3.599929 2.028232 1.800907
C  -0.384213 -2.926044 0.479797
C  4.438389 -2.431605 -0.081596
C  1.090764 -4.589527 1.367393
C  -0.190722 -4.095885 1.204614
C  -2.208571 -1.847389 -0.666179
C  -1.726702 -1.97246 -1.963927
C  -3.359413 -1.110065 -0.412416
C  -2.392358 -1.326241 -2.997632
C  -4.019822 -0.484109 -1.456942
C  -3.534949 -0.578363 -2.754581
H  3.961998 1.702907 -1.630562
H  2.720343 1.988551 1.128625
H  2.817979 3.897608 -1.251471
H  4.563193 4.084764 -1.310958
H  3.731861 4.112981 0.24243
H  5.292913 2.159991 1.088357
H  6.089001 2.34469 -0.470792
H  5.535925 0.763725 0.034176
H  1.613081 1.804301 -1.563604
H  3.13652 -2.419434 -1.677351
H  0.914648 1.143094 1.99415
H  -2.914782 2.427999 -0.837674
H  -1.272261 1.318045 2.974943
H  0.536078 -1.336876 -0.631359
H  3.170366 -4.349947 0.935836
H  1.245845 -5.49642 1.936581
H  -1.040124 -4.605665 1.641214
H  -0.851658 -2.567601 -2.187564
H  -3.73383 -1.034961 0.600328
H  -2.009257 -1.419568 -4.005679
H  -4.915978 0.086699 -1.250902
H  -4.045837 -0.080231 -3.567876
elementType: Cl F O N C H
totalener: -2099.13002520 hartree
nucrepener: 4091.19269247 hartree
electener: -6190.32271767 hartree
twoeener: 4826.21465171 hartree
cpcmener: -0.03812154 hartree
kineticenergy: 2091.77378150 hartree
xcener: -173.915079907881 hartree
chargesum: -0.0000000
charge: -0.102359 -0.187349 -0.185765 -0.190016 -0.270087 -0.393582 -0.319148 -0.165217 -0.080671 0.073590 0.045039 -0.288894 -0.297563 0.340021 0.207862 0.455657 -0.047089 -0.223535 0.006674 -0.098161 -0.095660 -0.168492 -0.333830 -0.219923 0.572204 0.368767 -0.241445 -0.088394 -0.264306 0.341318 -0.233039 -0.246832 -0.155066 -0.127247 -0.189951 0.061101 0.122316 0.085481 0.098115 0.088640 0.097620 0.094260 0.093552 0.150546 0.146046 0.130168 0.127442 0.144283 0.155550 0.134735 0.159443 0.144538 0.163026 0.139343 0.157440 0.153312 0.155532
qa: -0.1024 -0.1873 -0.1858 -0.1900 -0.2701 -0.3936 -0.3191 -0.1652 -0.0807 0.0736 0.0450 -0.2889 -0.2976 0.3400 0.2079 0.4557 -0.0471 -0.2235 0.0067 -0.0982 -0.0957 -0.1685 -0.3338 -0.2199 0.5722 0.3688 -0.2414 -0.0884 -0.2643 0.3413 -0.2330 -0.2468 -0.1551 -0.1272 -0.1900 0.0611 0.1223 0.0855 0.0981 0.0886 0.0976 0.0943 0.0936 0.1505 0.1460 0.1302 0.1274 0.1443 0.1555 0.1347 0.1594 0.1445 0.1630 0.1393 0.1574 0.1533 0.1555
va: 1.2254 1.1031 1.1140 1.1002 2.1402 2.1049 2.0910 3.1530 3.0961 3.8015 3.9107 3.9402 3.9593 4.0739 3.7827 3.8250 3.8660 3.8914 3.7503 3.6159 3.9160 4.0870 3.9957 3.9736 4.3973 3.6274 4.0879 3.8974 4.0413 3.6314 3.8980 3.9146 3.8808 3.8295 3.8940 1.0268 1.0103 1.0206 1.0051 1.0015 1.0044 1.0032 1.0072 1.0518 0.9885 1.0277 1.0248 1.0092 0.9917 1.0167 0.9894 1.0081 0.9931 1.0263 0.9903 0.9980 0.9903
dispcorr: -0.038621112 hartree
energy: -2099.168646311143
dipole: 35.17988 -34.73043 0.44944 -5.05659 5.50247 0.44587 -9.82194 7.76914 -2.05280
magnitude: 2.14821 au
magnitude: 5.46031 debye
