program: Orca
programVersion: 5.0.2
elementType: Cl F F F O O O N N C C C C C C C C C C C C C C C C C C C C C C C C C C H H H H H H H H H H H H H H H H H H H H H H
charge: 0
multiplicity: 1
keywords: wb97x-d3
keywords: def2-TZVPP
keywords: def2/J RIJCOSX
keywords: DEFGRID2
keywords: scfconv7
keywords: smallprint printgap noloewdin
keywords: NOSOSCF
formula: C26H22ClF3N2O3
InChI: InChI=1/C26H22ClF3N2O3/c1-16(2)24(32-22-12-11-18(14-21(22)27)26(28,29)30)25(33)35-23(15-31)17-7-6-10-20(13-17)34-19-8-4-3-5-9-19/h3-14,16,23-24,32H,1-2H3
57 atoms
Cl -0.689252 3.618408 -1.727544
F  -3.014587 0.143354 2.977861
F  -3.778896 2.114825 2.585195
F  -4.004355 0.568815 1.114028
O  3.187078 -0.754521 0.127912
O  1.909267 -0.234865 -1.636117
O  -2.001874 -2.837202 -0.028359
N  1.742243 2.356467 -0.54847
N  4.862105 -3.45208 1.015663
C  4.052695 2.08418 -1.285676
C  2.926768 1.552313 -0.378068
C  4.420373 3.507464 -0.883566
C  5.283706 1.185179 -1.24867
C  2.607246 0.100442 -0.718993
C  0.579015 2.071049 0.107208
C  2.847528 -2.139437 -0.002033
C  -0.654688 2.58689 -0.331292
C  0.545675 1.26903 1.255431
C  1.554255 -2.41278 0.724129
C  -1.848559 1.445209 1.406593
C  -1.843194 2.277682 0.291976
C  -0.642661 0.960794 1.890038
C  0.391756 -2.566061 -0.017164
C  1.510593 -2.408315 2.114586
C  -3.152164 1.068875 2.02305
C  -0.826526 -2.673085 0.641841
C  3.977765 -2.866746 0.575499
C  0.292914 -2.558063 2.757355
C  -0.881212 -2.673595 2.027545
C  -2.302734 -2.095381 -1.137411
C  -3.246055 -2.643828 -1.998122
C  -1.759126 -0.84219 -1.393675
C  -3.641951 -1.935513 -3.122013
C  -2.156614 -0.152231 -2.530957
C  -3.095417 -0.689437 -3.399518
H  3.66755 2.094051 -2.312109
H  3.275021 1.607732 0.657408
H  3.576149 4.193483 -0.948652
H  5.203534 3.892445 -1.538029
H  4.799517 3.538266 0.140286
H  5.10214 0.195775 -1.671175
H  5.658431 1.05699 -0.231195
H  6.084232 1.633249 -1.838075
H  1.640778 2.754993 -1.470813
H  2.771664 -2.430426 -1.053748
H  1.461311 0.87368 1.672793
H  -2.765667 2.67891 -0.108884
H  -0.602638 0.328246 2.765399
H  0.437666 -2.592135 -1.098541
H  2.415995 -2.292178 2.697903
H  0.251317 -2.565207 3.838487
H  -1.835259 -2.773372 2.529475
H  -3.668876 -3.617453 -1.782933
H  -1.034208 -0.395419 -0.726406
H  -4.378893 -2.36715 -3.78705
H  -1.727045 0.820948 -2.731389
H  -3.400409 -0.142205 -4.281646
elementType: Cl F O N C H
totalener: -2099.13229147 hartree
nucrepener: 4143.36938339 hartree
electener: -6242.50167487 hartree
twoeener: 4878.23639442 hartree
cpcmener: -0.03547830 hartree
kineticenergy: 2091.78891885 hartree
xcener: -173.912585654733 hartree
chargesum: 0.0000000
charge: -0.100846 -0.184322 -0.186966 -0.187872 -0.252405 -0.415332 -0.326186 -0.217017 -0.083491 0.075160 0.086573 -0.292352 -0.302766 0.318592 0.198597 0.394471 -0.000989 -0.179602 0.025795 -0.034335 -0.186948 -0.207199 -0.212202 -0.221001 0.566093 0.329143 -0.226804 -0.119859 -0.246722 0.316056 -0.253504 -0.161831 -0.119536 -0.157602 -0.194692 0.059867 0.116293 0.093322 0.096651 0.087740 0.093523 0.096552 0.094641 0.149737 0.138900 0.144041 0.123145 0.160824 0.147224 0.140416 0.159715 0.144082 0.143155 0.101622 0.156725 0.158045 0.155681
qa: -0.1008 -0.1843 -0.1870 -0.1879 -0.2524 -0.4153 -0.3262 -0.2170 -0.0835 0.0752 0.0866 -0.2924 -0.3028 0.3186 0.1986 0.3945 -0.0010 -0.1796 0.0258 -0.0343 -0.1869 -0.2072 -0.2122 -0.2210 0.5661 0.3291 -0.2268 -0.1199 -0.2467 0.3161 -0.2535 -0.1618 -0.1195 -0.1576 -0.1947 0.0599 0.1163 0.0933 0.0967 0.0877 0.0935 0.0966 0.0946 0.1497 0.1389 0.1440 0.1231 0.1608 0.1472 0.1404 0.1597 0.1441 0.1432 0.1016 0.1567 0.1580 0.1557
va: 1.2204 1.1148 1.1065 1.1022 2.1421 2.0900 2.0943 3.2068 3.1105 3.7990 3.8563 3.9328 3.9472 4.1235 3.8655 3.7641 3.8274 3.8701 3.5810 3.5529 4.0797 3.9788 3.9408 3.9455 4.4064 3.6483 4.0630 3.8540 3.9717 3.7021 3.9844 3.8264 3.8919 3.8946 3.9409 1.0256 1.0122 1.0182 1.0050 1.0017 1.0097 1.0040 1.0044 1.0453 1.0175 1.0137 1.0294 1.0028 1.0129 1.0101 0.9890 1.0116 1.0100 1.0071 0.9886 0.9963 0.9916
dispcorr: -0.040516779 hartree
energy: -2099.172808252248
dipole: 36.31476 -35.13179 1.18298 -1.75338 2.89587 1.14249 -14.62064 14.07624 -0.54439
magnitude: 1.73236 au
magnitude: 4.40331 debye
