program: Orca
programVersion: 5.0.2
elementType: Cl F F F O O O N N C C C C C C C C C C C C C C C C C C C C C C C C C C H H H H H H H H H H H H H H H H H H H H H H
charge: 0
multiplicity: 1
keywords: wb97x-d3
keywords: def2-TZVPP
keywords: def2/J RIJCOSX
keywords: DEFGRID2
keywords: scfconv7
keywords: smallprint printgap noloewdin
keywords: NOSOSCF
formula: C26H22ClF3N2O3
InChI: InChI=1/C26H22ClF3N2O3/c1-16(2)24(32-22-12-11-18(14-21(22)27)26(28,29)30)25(33)35-23(15-31)17-7-6-10-20(13-17)34-19-8-4-3-5-9-19/h3-14,16,23-24,32H,1-2H3
57 atoms
Cl 0.661304 3.209741 -2.289329
F  -3.856839 1.930907 -0.112664
F  -3.409149 0.538506 1.470488
F  -3.500262 2.639837 1.883768
O  2.997331 -0.228816 -0.429516
O  3.65713 -0.428464 1.695365
O  -2.164535 -1.266609 -0.859458
N  2.450532 2.379534 -0.065738
N  4.48707 -3.268015 0.252984
C  4.87747 2.264905 0.269306
C  3.485881 1.779199 0.730439
C  5.960682 1.862503 1.2625
C  5.259603 1.828554 -1.141709
C  3.396386 0.259761 0.746186
C  1.124629 2.180328 0.177561
C  2.631023 -1.601502 -0.524364
C  0.151529 2.544042 -0.768807
C  0.650455 1.635984 1.382096
C  1.284113 -1.842663 0.111598
C  -1.638985 1.865496 0.670357
C  -1.199381 2.394208 -0.53505
C  -0.699855 1.484099 1.621747
C  0.163509 -1.497118 -0.637853
C  1.136287 -2.342266 1.397836
C  -3.093174 1.742024 0.970399
C  -1.100071 -1.645483 -0.093363
C  3.677873 -2.505928 -0.037391
C  -0.13758 -2.478208 1.933165
C  -1.259206 -2.126395 1.201604
C  -3.241128 -2.102177 -0.984553
C  -3.117344 -3.486415 -0.979893
C  -4.480138 -1.505411 -1.175066
C  -4.250827 -4.268555 -1.152663
C  -5.601623 -2.300768 -1.35511
C  -5.496058 -3.684603 -1.337687
H  4.799858 3.356636 0.281147
H  3.374526 2.094435 1.771864
H  5.703826 2.14958 2.283139
H  6.898573 2.357578 1.00871
H  6.15205 0.78821 1.252104
H  5.446557 0.75502 -1.201605
H  6.181309 2.33063 -1.438006
H  4.513342 2.080033 -1.897718
H  2.700698 2.612906 -1.013903
H  2.558854 -1.781777 -1.599191
H  1.340242 1.336085 2.158669
H  -1.89723 2.695053 -1.304466
H  -1.008619 1.063269 2.570125
H  0.270889 -1.116947 -1.647269
H  1.995422 -2.633366 1.987156
H  -0.256862 -2.85999 2.93839
H  -2.245312 -2.236468 1.634374
H  -2.152807 -3.960605 -0.849684
H  -4.565516 -0.427447 -1.189919
H  -4.151907 -5.346339 -1.146273
H  -6.565219 -1.830349 -1.502531
H  -6.374645 -4.301825 -1.470295
elementType: Cl F O N C H
totalener: -2099.13016998 hartree
nucrepener: 4080.12637929 hartree
electener: -6179.25654927 hartree
twoeener: 4815.64526767 hartree
cpcmener: -0.03688377 hartree
kineticenergy: 2091.80347446 hartree
xcener: -173.916926914193 hartree
chargesum: 0.0000000
charge: -0.099026 -0.187872 -0.186108 -0.185744 -0.259853 -0.402668 -0.326489 -0.235884 -0.080490 0.047326 0.139549 -0.310802 -0.291501 0.298950 0.190231 0.408556 -0.022390 -0.193679 0.026898 -0.073624 -0.089029 -0.215349 -0.316716 -0.141687 0.577773 0.285777 -0.237545 -0.145801 -0.172267 0.292283 -0.191173 -0.261003 -0.155688 -0.129505 -0.182910 0.065689 0.133310 0.100098 0.100327 0.087165 0.086074 0.103823 0.090169 0.156426 0.139356 0.136170 0.124419 0.145931 0.128398 0.139507 0.160318 0.154228 0.151814 0.152197 0.158179 0.156819 0.157040
qa: -0.0990 -0.1879 -0.1861 -0.1857 -0.2599 -0.4027 -0.3265 -0.2359 -0.0805 0.0473 0.1395 -0.3108 -0.2915 0.2989 0.1902 0.4086 -0.0224 -0.1937 0.0269 -0.0736 -0.0890 -0.2153 -0.3167 -0.1417 0.5778 0.2858 -0.2375 -0.1458 -0.1723 0.2923 -0.1912 -0.2610 -0.1557 -0.1295 -0.1829 0.0657 0.1333 0.1001 0.1003 0.0872 0.0861 0.1038 0.0902 0.1564 0.1394 0.1362 0.1244 0.1459 0.1284 0.1395 0.1603 0.1542 0.1518 0.1522 0.1582 0.1568 0.1570
va: 1.2292 1.1092 1.1015 1.1051 2.1466 2.1009 2.0144 3.2155 3.1064 3.8610 3.8622 3.9430 3.9454 4.1348 3.8272 3.8989 3.9072 3.8575 3.5834 3.6012 4.0083 4.0510 4.1068 3.9064 4.3676 3.5820 4.0448 3.9507 3.9226 3.7017 3.9034 3.9818 3.9037 3.9161 3.9069 1.0177 1.0049 1.0046 1.0016 1.0075 1.0100 1.0035 1.0111 1.0457 0.9966 1.0184 1.0279 1.0108 1.0212 1.0202 0.9907 1.0029 0.9998 1.0189 0.9909 0.9910 0.9905
dispcorr: -0.038614318 hartree
energy: -2099.168784292888
dipole: 30.74937 -30.52938 0.21999 -12.63183 13.45641 0.82458 1.19811 -1.90230 -0.70420
magnitude: 1.10644 au
magnitude: 2.81236 debye
