program: Orca
programVersion: 5.0.2
elementType: Cl F F F O O O N N C C C C C C C C C C C C C C C C C C C C C C C C C C H H H H H H H H H H H H H H H H H H H H H H
charge: 0
multiplicity: 1
keywords: wb97x-d3
keywords: def2-TZVPP
keywords: def2/J RIJCOSX
keywords: DEFGRID2
keywords: scfconv7
keywords: smallprint printgap noloewdin
keywords: NOSOSCF
formula: C26H22ClF3N2O3
InChI: InChI=1/C26H22ClF3N2O3/c1-16(2)24(32-22-12-11-18(14-21(22)27)26(28,29)30)25(33)35-23(15-31)17-7-6-10-20(13-17)34-19-8-4-3-5-9-19/h3-14,16,23-24,32H,1-2H3
57 atoms
Cl 1.973376 4.640414 2.041852
F  -2.48952 6.869171 0.350014
F  -3.967859 5.320432 0.135021
F  -3.447946 6.055179 2.088423
O  0.301333 -0.78237 -0.756549
O  1.33879 1.144289 -1.192244
O  -0.558585 -5.844533 -1.428243
N  1.145831 1.844116 1.499651
N  2.442366 -1.372456 -3.333727
C  2.252319 -0.322881 1.655473
C  1.037476 0.467473 1.113207
C  2.050265 -1.83188 1.57477
C  3.575254 0.075843 1.008795
C  0.921069 0.345715 -0.399716
C  0.159564 2.759631 1.308644
C  0.134934 -1.032737 -2.149041
C  0.390712 4.127893 1.545964
C  -1.135116 2.405671 0.903322
C  -0.692174 -2.284169 -2.282099
C  -1.871512 4.695134 0.994435
C  -0.595902 5.076082 1.396483
C  -2.12946 3.352974 0.753983
C  -0.192737 -3.485016 -1.787338
C  -1.946546 -2.221195 -2.866462
C  -2.940147 5.726994 0.887273
C  -0.97381 -4.627329 -1.869221
C  1.442056 -1.203974 -2.795511
C  -2.71022 -3.378756 -2.956754
C  -2.235643 -4.577132 -2.45628
C  0.447072 -5.929059 -0.496659
C  0.308196 -5.347292 0.757088
C  1.57948 -6.657034 -0.824493
C  1.326958 -5.495184 1.686598
C  2.586984 -6.807334 0.119566
C  2.468182 -6.223241 1.37246
H  2.290321 -0.052937 2.715508
H  0.142709 0.029059 1.565478
H  2.135702 -2.210075 0.555357
H  1.079339 -2.132385 1.971006
H  2.816242 -2.333982 2.166754
H  3.629203 -0.238715 -0.035471
H  4.399192 -0.409348 1.533346
H  3.773698 1.148837 1.042111
H  2.080095 2.202126 1.62037
H  -0.369293 -0.191551 -2.633729
H  -1.383525 1.371907 0.705357
H  -0.360084 6.113683 1.595115
H  -3.110157 3.019608 0.442317
H  0.797634 -3.522977 -1.348701
H  -2.327062 -1.282204 -3.247365
H  -3.690794 -3.34294 -3.41246
H  -2.834808 -5.476827 -2.51915
H  -0.584963 -4.787954 1.008076
H  1.669462 -7.106691 -1.80547
H  1.222907 -5.043587 2.664783
H  3.470524 -7.379678 -0.132162
H  3.258447 -6.336483 2.102922
elementType: Cl F O N C H
totalener: -2099.13428742 hartree
nucrepener: 3771.73639521 hartree
electener: -5870.87068263 hartree
twoeener: 4506.36174304 hartree
cpcmener: -0.04038536 hartree
kineticenergy: 2091.79768159 hartree
xcener: -173.910884402421 hartree
chargesum: -0.0000000
charge: -0.098152 -0.186547 -0.183665 -0.186896 -0.264622 -0.402858 -0.325246 -0.233979 -0.085948 0.071799 0.137902 -0.336526 -0.285042 0.287669 0.207800 0.407883 -0.042705 -0.196085 0.005031 -0.080205 -0.119629 -0.167826 -0.206485 -0.194043 0.553635 0.244732 -0.232399 -0.112664 -0.228108 0.267780 -0.193540 -0.220116 -0.162189 -0.132399 -0.158059 0.065899 0.130337 0.074630 0.100570 0.106873 0.088711 0.103439 0.092721 0.156833 0.133710 0.135299 0.126400 0.148415 0.152204 0.145715 0.158590 0.147123 0.157625 0.147203 0.161728 0.158735 0.158942
qa: -0.0982 -0.1865 -0.1837 -0.1869 -0.2646 -0.4029 -0.3252 -0.2340 -0.0859 0.0718 0.1379 -0.3365 -0.2850 0.2877 0.2078 0.4079 -0.0427 -0.1961 0.0050 -0.0802 -0.1196 -0.1678 -0.2065 -0.1940 0.5536 0.2447 -0.2324 -0.1127 -0.2281 0.2678 -0.1935 -0.2201 -0.1622 -0.1324 -0.1581 0.0659 0.1303 0.0746 0.1006 0.1069 0.0887 0.1034 0.0927 0.1568 0.1337 0.1353 0.1264 0.1484 0.1522 0.1457 0.1586 0.1471 0.1576 0.1472 0.1617 0.1587 0.1589
va: 1.2299 1.1104 1.1164 1.0982 2.1761 2.0951 2.0880 3.2096 3.1027 3.8542 3.8733 3.9600 3.9396 4.1427 3.8453 3.7664 3.9408 3.9242 3.7270 3.6759 4.0761 4.0467 3.9444 3.9397 4.4295 3.8057 4.0184 3.9091 4.0029 3.6891 3.9118 4.0077 3.8613 3.8914 3.8898 1.0198 1.0087 1.0028 1.0017 1.0026 1.0072 1.0026 1.0119 1.0446 1.0173 1.0152 1.0268 1.0091 1.0036 1.0020 0.9894 1.0063 0.9972 1.0060 0.9881 0.9890 0.9899
dispcorr: -0.032598268 hartree
energy: -2099.166885690303
dipole: 23.32884 -23.94954 -0.62071 -58.91665 56.51454 -2.40211 0.88272 0.61408 1.49680
magnitude: 2.89755 au
magnitude: 7.36499 debye
