program: Gaussian 09
title: 000067507
version: EM64L-G09RevD.01
frameworkgroup: C1[X(C7H6N2)]
method: RPBEPBE
basis: SDD
operation: Freq
keyword: #p
keyword: freq=noraman
keyword: PBEPBE/SDD
title: #p freq=noraman PBEPBE/SDD
converged: NO YES NO NO
title: Mulliken charges:
elementType: N N C C C C C C C H H H H H H
charge: -0.239138 -0.072555 0.484513 -0.329247 -0.447075 -0.214470 -0.198392 -0.203821 -0.289091 0.245378 0.263284 0.274891 0.237812 0.230740 0.257170
chargesum: 0.00000
title: Mulliken charges with hydrogens summed into heavy atoms:
elementType: N N C C C C C C C
charge: -0.239138 -0.072555 0.484513 -0.083868 -0.183791 0.060421 0.039421 0.026919 -0.031920
polarizability: 1.28840128e+02 -1.19455328e+00 8.91728476e+01 1.07334855e-03 2.85086384e-04 3.52528420e+01
1716.lowfreq: -15.1648 -0.0005 0.0005 0.0006 3.4822 13.0663 211.7024 232.9034 404.7003
frequency: 211.7006 232.9032 404.7002 420.2932 554.1408 567.2457 614.1103 621.4765 731.4839 745.3756 754.5324 788.5743 844.4334 862.0601 883.3190 897.7072 935.6047 971.4125 1010.2090 1048.0814 1100.0591 1136.7379 1167.5463 1204.9135 1250.7382 1271.1388 1343.1421 1373.6299 1410.8578 1452.4907 1521.9549 1533.6998 1635.0108 3150.6323 3169.1038 3180.4386 3208.5267 3220.9505 3248.7370
redmass: 4.3610 4.2363 4.4041 2.7820 6.8986 3.5970 6.5002 4.1084 2.7528 1.3812 5.0656 1.3502 1.4222 6.0365 1.3519 4.7313 1.3392 1.2989 2.2637 1.4202 2.3399 1.4809 1.3062 2.5044 2.2158 2.2323 2.3445 2.4753 2.7981 3.2491 4.6947 6.4599 6.7530 1.0869 1.0926 1.0963 1.0989 1.0933 1.1040
irintensity: 3.3586 1.3368 4.9882 17.4123 0.4592 3.9294 0.3799 0.0647 3.1358 44.0820 0.2105 128.2445 6.6110 2.5675 2.5913 2.0862 3.0911 0.3836 6.5729 7.0633 10.6998 6.2608 5.4734 18.4409 10.6663 3.3484 42.3439 6.7919 5.8293 10.5961 22.8819 3.9031 16.3609 2.6113 10.7723 8.0141 3.2722 3.9939 1.4905
temp: 298.150 k
press: 1.00000 atm
elementType: 7 7 6 6 6 6 6 6 6 1 1 1 1 1 1
symmnumber: 1
zpe: 303131.8 jmol-1
zpe.correction: 0.115457 hartree
zpe.thermalcorrener: 0.121521 hartree
zpe.thermalcorrenthalpy: 0.122465 hartree
zpe.thermalcorrgfe: 0.085239 hartree
zpe.sumelectzpe: -379.199922 hartree
zpe.sumelectthermal: -379.193858 hartree
zpe.sumelectthermalent: -379.192913 hartree
zpe.sumelectthermalfe: -379.230140 hartree
dipole: 1.9348 1.4227 0.0001
dipole: 2.4015
quadrupole: -45.1762 -47.9917 -56.6631
quadrupole: -4.3411 0.0000 0.0000
quadrupole: 4.7675 1.9519 -6.7194 -4.3411 0.0000 0.0000
hfenergy: -379.3153785 hartree
pointgroup: C01 [X(C7H6N2)]
dipole: -0.7634633 -0.5566257 0.0000232 debye
dipolederiv: -0.1305508 0.0457922 -0.0000079 0.5890278 -0.2148753 -0.000006 -0.0000049 0.0000069 0.0670447 -0.3087832 0.1387553 0.0000077 -0.1415836 -0.3393693 -0.0000028 0. 0.0000055 -0.2273564 0.4173096 -0.1393224 -0.0000059 -0.5095825 -0.0526495 0.0000066 0.000006 -0.0000005 0.0398718 -0.0573765 0.0673612 0.0000001 0.0496537 0.0693313 -0.0000016 -0.0000054 0.0000012 -0.131496 -0.4851991 -0.1187872 0.0000065 -0.0081929 -0.0900727 -0.0000008 0.0000091 -0.0000093 -0.2875811 0.2375694 0.069981 -0.000004 -0.1174787 0.1153836 0.0000007 -0.0000054 -0.000005 -0.0972594 0.0198965 0.0722071 -0.0000026 -0.063063 0.1266757 0.0000011 0.0000036 -0.000005 -0.1560323 -0.0404248 -0.1415457 -0.0000028 0.030924 -0.0770669 -0.0000034 -0.0000009 0.0000016 -0.1931532 0.2156829 0.0055029 0.000002 0.1454939 0.3417715 0. -0.0000104 -0.0000047 -0.1121264 0.080074 0.0132142 0.0000013 -0.0242621 -0.0680232 0.0000016 -0.0000003 0.0000004 0.1696208 0.0996304 0.0271839 -0.000001 0.0600692 -0.0227113 0.0000012 -0.0000043 0.0000046 0.2230009 0.0861743 -0.0362615 0.0000019 0.012057 0.0126174 0.0000009 0.0000008 0.0000015 0.1855849 -0.0646749 -0.0852378 0.000003 -0.0804425 0.0503395 0.0000019 0.000002 0.0000017 0.168149 -0.0222743 0.0924814 0.0000016 0.0848165 0.0342426 0. 0.0000012 0.0000008 0.1749046 -0.0470534 -0.0113244 0. -0.0274369 0.1144066 0.0000007 0.000009 0.0000004 0.1768281 unknown
polarizability: 128.8297821|-1.3554563|89.183194|-0.0010745|-0.0002807|35.252842 unknown
InChI: InChI=1S/C7H6N2/c1-2-6-9-7(3-1)4-5-8-9/h1-6H
charge 0 multiplicity 1
15 atoms
N  0.270114 0.643722 -0.000067
N  1.556462 1.178557 -0.000092
C  0.267246 -0.782748 -0.00005
C  -0.998537 -1.444036 -0.000026
C  1.633882 -1.157623 -0.000074
C  -0.885841 1.402424 -0.000051
C  -2.171505 -0.686201 -0.000014
C  -2.111593 0.751071 -0.000028
C  2.362135 0.061532 -0.000059
H  -1.022235 -2.537467 -0.000022
H  2.033217 -2.168271 -0.000071
H  -0.744045 2.484116 -0.000061
H  -3.147396 -1.181343 -0.000001
H  -3.028374 1.346323 -0.000023
H  3.442171 0.201844 -0.000062
