program: Orca
programVersion: 5.0.2
elementType: Cl F F F O O O N N C C C C C C C C C C C C C C C C C C C C C C C C C C H H H H H H H H H H H H H H H H H H H H H H
charge: 0
multiplicity: 1
keywords: wb97x-d3
keywords: def2-TZVPP
keywords: def2/J RIJCOSX
keywords: DEFGRID2
keywords: scfconv7
keywords: smallprint printgap noloewdin
keywords: NOSOSCF
formula: C26H22ClF3N2O3
InChI: InChI=1/C26H22ClF3N2O3/c1-16(2)24(32-22-12-11-18(14-21(22)27)26(28,29)30)25(33)35-23(15-31)17-7-6-10-20(13-17)34-19-8-4-3-5-9-19/h3-14,16,23-24,32H,1-2H3
57 atoms
Cl -1.847924 1.105211 -1.125258
F  -2.821074 0.809887 4.026542
F  -1.38324 2.031124 5.062632
F  -3.03881 2.944259 4.039378
O  1.94769 -0.162815 0.032946
O  3.845275 0.809877 0.715962
O  -1.386532 -3.437453 -1.845649
N  0.936888 2.139919 -0.822528
N  0.974862 -0.866521 3.150287
C  2.936365 1.89949 -2.221996
C  2.373721 2.011566 -0.786899
C  4.443137 2.119672 -2.249218
C  2.57212 0.59926 -2.934127
C  2.827665 0.842638 0.080628
C  0.19937 2.130954 0.331384
C  2.141516 -1.303442 0.848432
C  -1.12975 1.67503 0.34755
C  0.725748 2.571791 1.552109
C  1.516179 -2.503052 0.177184
C  -1.313119 2.037174 2.711123
C  -1.871953 1.622871 1.507345
C  -0.01327 2.522602 2.719024
C  0.331777 -2.369623 -0.536726
C  2.12825 -3.741304 0.311417
C  -2.130362 1.957303 3.956471
C  -0.217231 -3.489301 -1.147113
C  1.490367 -1.048306 2.139934
C  1.549111 -4.855047 -0.279033
C  0.384473 -4.734616 -1.018423
C  -1.677572 -2.3552 -2.634498
C  -2.989645 -1.906825 -2.633305
C  -0.724815 -1.762216 -3.454404
C  -3.351502 -0.853016 -3.46053
C  -1.09854 -0.702057 -4.267113
C  -2.408398 -0.241291 -4.274067
H  2.468059 2.728505 -2.762263
H  2.815028 2.907033 -0.341372
H  4.988188 1.307024 -1.766302
H  4.72424 3.053176 -1.759615
H  4.792185 2.17165 -3.281653
H  3.101334 -0.25916 -2.516053
H  2.856928 0.668392 -3.984639
H  1.504002 0.374552 -2.914509
H  0.496029 1.691994 -1.612295
H  3.202619 -1.492919 1.034883
H  1.733691 2.961434 1.600261
H  -2.884039 1.241237 1.463012
H  0.45121 2.865088 3.63362
H  -0.160587 -1.40866 -0.620632
H  3.051048 -3.836586 0.869507
H  2.019778 -5.823975 -0.178747
H  -0.059631 -5.599439 -1.494894
H  -3.721259 -2.380224 -1.990682
H  0.29728 -2.120032 -3.468686
H  -4.376213 -0.504511 -3.459241
H  -0.357018 -0.238979 -4.905506
H  -2.691794 0.585888 -4.91143
elementType: Cl F O N C H
totalener: -2099.12952513 hartree
nucrepener: 4099.30415321 hartree
electener: -6198.43367833 hartree
twoeener: 4834.85511142 hartree
cpcmener: -0.03745764 hartree
kineticenergy: 2091.78881758 hartree
xcener: -173.912316983337 hartree
chargesum: 0.0000000
charge: -0.109771 -0.186542 -0.182874 -0.187051 -0.244491 -0.401597 -0.326236 -0.239587 -0.084924 0.041839 0.132569 -0.310179 -0.254740 0.288569 0.133844 0.357937 0.025415 -0.180946 0.053228 -0.076516 -0.110190 -0.166245 -0.159402 -0.211010 0.557657 0.254427 -0.223899 -0.108453 -0.237102 0.287408 -0.232538 -0.185679 -0.141521 -0.149517 -0.174125 0.064053 0.129634 0.086985 0.098067 0.099197 0.088256 0.108072 0.043284 0.151629 0.135502 0.149755 0.126131 0.146191 0.100863 0.145140 0.158712 0.147610 0.144549 0.158279 0.154668 0.159971 0.155694
qa: -0.1098 -0.1865 -0.1829 -0.1871 -0.2445 -0.4016 -0.3262 -0.2396 -0.0849 0.0418 0.1326 -0.3102 -0.2547 0.2886 0.1338 0.3579 0.0254 -0.1809 0.0532 -0.0765 -0.1102 -0.1662 -0.1594 -0.2110 0.5577 0.2544 -0.2239 -0.1085 -0.2371 0.2874 -0.2325 -0.1857 -0.1415 -0.1495 -0.1741 0.0641 0.1296 0.0870 0.0981 0.0992 0.0883 0.1081 0.0433 0.1516 0.1355 0.1498 0.1261 0.1462 0.1009 0.1451 0.1587 0.1476 0.1445 0.1583 0.1547 0.1600 0.1557
va: 1.2477 1.1093 1.1179 1.1013 2.1437 2.1114 2.0849 3.1950 3.0939 3.8839 3.8406 3.9508 3.9420 4.1902 3.8678 3.7470 3.8556 3.8934 3.6755 3.6348 4.0774 3.9895 3.9349 3.9672 4.4273 3.7610 4.0226 3.8936 4.0029 3.6722 3.9761 3.8828 3.8549 3.8460 3.8621 1.0184 1.0031 1.0079 1.0041 1.0016 1.0096 1.0065 1.0204 1.0518 1.0331 1.0069 1.0249 1.0100 1.0436 1.0012 0.9891 1.0057 1.0074 0.9941 0.9912 0.9897 0.9915
dispcorr: -0.038962233 hartree
energy: -2099.168487358485
dipole: 32.05176 -30.30075 1.75100 -8.00224 7.72218 -0.28006 -42.23173 38.77450 -3.45723
magnitude: 3.88547 au
magnitude: 9.87608 debye
